null
SMILES: COc1ccc2nccc(C3CN(C4CCN(Cc5ccc6ccccc6c5)CC4)C(=O)O3)c2c1
InChI Key: InChIKey=CXPWIZLGIZBSFJ-UHFFFAOYSA-N
Activity Spreadsheet -- Enzyme Inhibition Constant Data from BindingDB
Found 1 hit for monomerid = 50423263
Trg + Lig
Ki
nM
ΔG°
kcal/mole
IC50
nM
Kd
nM
EC50/IC50
nM
koff
s-1
kon
M-1s-1
pHTemp
°C
C-C chemokine receptor type 8
(Homo sapiens (Human))
BDBM50423263
(CHEMBL247762)
Show SMILES COc1ccc2nccc(C3CN(C4CCN(Cc5ccc6ccccc6c5)CC4)C(=O)O3)c2c1
Show InChI InChI=1S/C29H29N3O3/c1-34-24-8-9-27-26(17-24)25(10-13-30-27)28-19-32(29(33)35-28)23-11-14-31(15-12-23)18-20-6-7-21-4-2-3-5-22(21)16-20/h2-10,13,16-17,23,28H,11-12,14-15,18-19H2,1H3
Reactome pathway
n/an/a 1.26E+3n/an/an/an/an/an/a
GlaxoSmithKline
Curated by ChEMBL
Assay Description
Antagonist activity at human recombinant CCR8 expressed in RBL cells assessed as inhibition of I-309-induced intracellular calcium mobilization by FL...
Bioorg Med Chem Lett 17: 1722-5 (2007)
Article DOI: 10.1016/j.bmcl.2006.12.076
BindingDB Entry DOI: 10.7270/Q2668FG7