null
SMILES: COc1ccc2nccc(C3CN(C4CCN(CC5CCCCC5)CC4)C(=O)O3)c2c1
InChI Key: InChIKey=QYDKOWROHHZSPY-UHFFFAOYSA-N
Activity Spreadsheet -- Enzyme Inhibition Constant Data from BindingDB
Found 1 hit for monomerid = 50423264
Trg + Lig
Ki
nM
ΔG°
kcal/mole
IC50
nM
Kd
nM
EC50/IC50
nM
koff
s-1
kon
M-1s-1
pHTemp
°C
C-C chemokine receptor type 8
(Homo sapiens (Human))
BDBM50423264
(CHEMBL247963)
Show SMILES COc1ccc2nccc(C3CN(C4CCN(CC5CCCCC5)CC4)C(=O)O3)c2c1
Show InChI InChI=1S/C25H33N3O3/c1-30-20-7-8-23-22(15-20)21(9-12-26-23)24-17-28(25(29)31-24)19-10-13-27(14-11-19)16-18-5-3-2-4-6-18/h7-9,12,15,18-19,24H,2-6,10-11,13-14,16-17H2,1H3
Reactome pathway
n/an/a 7.94E+3n/an/an/an/an/an/a
GlaxoSmithKline
Curated by ChEMBL
Assay Description
Antagonist activity at human recombinant CCR8 expressed in RBL cells assessed as inhibition of I-309-induced intracellular calcium mobilization by FL...
Bioorg Med Chem Lett 17: 1722-5 (2007)
Article DOI: 10.1016/j.bmcl.2006.12.076
BindingDB Entry DOI: 10.7270/Q2668FG7