null
SMILES: CCCC(CCC)n1cc2CCN(c3ccc(cc3C(F)(F)F)C(F)(F)F)c3nc(C)nc1c23
InChI Key: InChIKey=CSSCMHXZJCPICP-UHFFFAOYSA-N
Activity Spreadsheet -- Enzyme Inhibition Constant Data from BindingDB
Found 1 hit for monomerid = 50423373
Trg + Lig
Ki
nM
ΔG°
kcal/mole
IC50
nM
Kd
nM
EC50/IC50
nM
koff
s-1
kon
M-1s-1
pHTemp
°C
Corticotropin-releasing factor receptor 1
(Homo sapiens (Human))
BDBM50423373
(CHEMBL178949)
Show SMILES CCCC(CCC)n1cc2CCN(c3ccc(cc3C(F)(F)F)C(F)(F)F)c3nc(C)nc1c23
Show InChI InChI=1S/C24H26F6N4/c1-4-6-17(7-5-2)34-13-15-10-11-33(21-20(15)22(34)32-14(3)31-21)19-9-8-16(23(25,26)27)12-18(19)24(28,29)30/h8-9,12-13,17H,4-7,10-11H2,1-3H3
Reactome pathway
n/an/a 16n/an/an/an/an/an/a
GlaxoSmithkline
Curated by ChEMBL
Assay Description
Displacement of [125I]CRF from human recombinant CRF1 receptor expressed in CHO cell membrane
Bioorg Med Chem Lett 17: 5218-21 (2007)
Article DOI: 10.1016/j.bmcl.2007.06.077
BindingDB Entry DOI: 10.7270/Q2P55PS1