null
SMILES: OC(=O)[C@H](Cc1ccc(NC(=O)c2c(Cl)cncc2Cl)cc1)NC(=O)[C@@H]1C[C@H](CN1S(=O)(=O)c1cccc(c1)C#N)NC1CCC1
InChI Key: InChIKey=USYYNLPEWBGIMJ-ICTDUYRTSA-N
Activity Spreadsheet -- Enzyme Inhibition Constant Data from BindingDB
Found 2 hits for monomerid = 50423686
Trg + Lig
Ki
nM
ΔG°
kcal/mole
IC50
nM
Kd
nM
EC50/IC50
nM
koff
s-1
kon
M-1s-1
pHTemp
°C
Integrin alpha-4/beta-1
(Homo sapiens (Human))
BDBM50423686
(CHEMBL506044 | MK-0668)
Show SMILES OC(=O)[C@H](Cc1ccc(NC(=O)c2c(Cl)cncc2Cl)cc1)NC(=O)[C@@H]1C[C@H](CN1S(=O)(=O)c1cccc(c1)C#N)NC1CCC1 |r|
Show InChI InChI=1S/C31H30Cl2N6O6S/c32-24-15-35-16-25(33)28(24)30(41)37-21-9-7-18(8-10-21)12-26(31(42)43)38-29(40)27-13-22(36-20-4-2-5-20)17-39(27)46(44,45)23-6-1-3-19(11-23)14-34/h1,3,6-11,15-16,20,22,26-27,36H,2,4-5,12-13,17H2,(H,37,41)(H,38,40)(H,42,43)/t22-,26+,27+/m1/s1
Reactome pathway
n/an/a 64n/an/an/an/an/an/a
Merck Research Laboratories
Curated by ChEMBL
Assay Description
Receptor occupancy of VLA4 in whole blood washed with buffer containing non activating Ca2+ and Mg2+ at 37 degC after 3 hrs
Bioorg Med Chem Lett 19: 5803-6 (2009)
Article DOI: 10.1016/j.bmcl.2009.07.111
BindingDB Entry DOI: 10.7270/Q2VQ33ZJ
Integrin alpha-4/beta-1
(Homo sapiens (Human))
BDBM50423686
(CHEMBL506044 | MK-0668)
Show SMILES OC(=O)[C@H](Cc1ccc(NC(=O)c2c(Cl)cncc2Cl)cc1)NC(=O)[C@@H]1C[C@H](CN1S(=O)(=O)c1cccc(c1)C#N)NC1CCC1 |r|
Show InChI InChI=1S/C31H30Cl2N6O6S/c32-24-15-35-16-25(33)28(24)30(41)37-21-9-7-18(8-10-21)12-26(31(42)43)38-29(40)27-13-22(36-20-4-2-5-20)17-39(27)46(44,45)23-6-1-3-19(11-23)14-34/h1,3,6-11,15-16,20,22,26-27,36H,2,4-5,12-13,17H2,(H,37,41)(H,38,40)(H,42,43)/t22-,26+,27+/m1/s1
Reactome pathway
n/an/a 0.150n/an/an/an/an/an/a
Merck Research Laboratories
Curated by ChEMBL
Assay Description
Displacement of [35S]-labeled ligand from VLA4 in human Jurkat cells washed with buffer containing non activating Ca2+ and Mg2+ by competitive bindin...
Bioorg Med Chem Lett 19: 5803-6 (2009)
Article DOI: 10.1016/j.bmcl.2009.07.111
BindingDB Entry DOI: 10.7270/Q2VQ33ZJ