BDBM50423699 CHEMBL571766
SMILES: CC[C@H](C)[C@H](NC(=O)CNC(=O)[C@H](CC(C)C)NC(=O)[C@H](CC(N)=O)NC(=O)[C@@H](N)CCSC)C(O)=O
InChI Key: InChIKey=WYMOSRUQCHLIBC-GMHRPJKWSA-N
Data: 1 Kd
Activity Spreadsheet -- Enzyme Inhibition Constant Data from BindingDB
Found 1 hit for monomerid = 50423699
Trg + Lig
Ki
nM
ΔG°
kcal/mole
IC50
nM
Kd
nM
EC50/IC50
nM
koff
s-1
kon
M-1s-1
pHTemp
°C
Cysteine synthase
(Haemophilus influenzae (strain ATCC 51907 / DSM 11...)
BDBM50423699
(CHEMBL571766)
Show SMILES CC[C@H](C)[C@H](NC(=O)CNC(=O)[C@H](CC(C)C)NC(=O)[C@H](CC(N)=O)NC(=O)[C@@H](N)CCSC)C(O)=O |r|
Show InChI InChI=1S/C23H42N6O7S/c1-6-13(4)19(23(35)36)29-18(31)11-26-21(33)15(9-12(2)3)28-22(34)16(10-17(25)30)27-20(32)14(24)7-8-37-5/h12-16,19H,6-11,24H2,1-5H3,(H2,25,30)(H,26,33)(H,27,32)(H,28,34)(H,29,31)(H,35,36)/t13-,14-,15-,16-,19-/m0/s1
n/an/an/a 5.75E+5n/an/an/an/an/a
University of Parma
Curated by ChEMBL
Assay Description
Binding affinity to Haemophilus influenzae O-acetylserine sulfhydrylase expressed in Escherichia coli BL21 (DE3) by fluorescence emission spectra ana...
J Med Chem 53: 345-56 (2010)
Article DOI: 10.1021/jm901325e
BindingDB Entry DOI: 10.7270/Q2QZ2C8P