BDBM50423700 CHEMBL568812
SMILES: CC[C@H](C)[C@H](NC(=O)CNC(=O)[C@H](CC(O)=O)NC(=O)[C@H](CC(N)=O)NC(=O)[C@@H](N)CCSC)C(O)=O
InChI Key: InChIKey=FQYJXCYGBNQQOD-SMXCXOSKSA-N
Data: 1 Kd
Activity Spreadsheet -- Enzyme Inhibition Constant Data from BindingDB
Found 1 hit for monomerid = 50423700
Trg + Lig
Ki
nM
ΔG°
kcal/mole
IC50
nM
Kd
nM
EC50/IC50
nM
koff
s-1
kon
M-1s-1
pHTemp
°C
Cysteine synthase
(Haemophilus influenzae (strain ATCC 51907 / DSM 11...)
BDBM50423700
(CHEMBL568812)
Show SMILES CC[C@H](C)[C@H](NC(=O)CNC(=O)[C@H](CC(O)=O)NC(=O)[C@H](CC(N)=O)NC(=O)[C@@H](N)CCSC)C(O)=O |r|
Show InChI InChI=1S/C21H36N6O9S/c1-4-10(2)17(21(35)36)27-15(29)9-24-19(33)13(8-16(30)31)26-20(34)12(7-14(23)28)25-18(32)11(22)5-6-37-3/h10-13,17H,4-9,22H2,1-3H3,(H2,23,28)(H,24,33)(H,25,32)(H,26,34)(H,27,29)(H,30,31)(H,35,36)/t10-,11-,12-,13-,17-/m0/s1
n/an/an/a 1.02E+6n/an/an/an/an/a
University of Parma
Curated by ChEMBL
Assay Description
Binding affinity to Haemophilus influenzae O-acetylserine sulfhydrylase expressed in Escherichia coli BL21 (DE3) by fluorescence emission spectra ana...
J Med Chem 53: 345-56 (2010)
Article DOI: 10.1021/jm901325e
BindingDB Entry DOI: 10.7270/Q2QZ2C8P