BDBM50423704 CHEMBL567022
SMILES: CC[C@H](C)[C@H](NC(=O)[C@H](Cc1cnc[nH]1)NC(=O)[C@@H]1CCCN1C(=O)[C@H](CC(N)=O)NC(=O)[C@@H](N)CCSC)C(O)=O
InChI Key: InChIKey=UFENKRZKXLOBPQ-LNZVJWDNSA-N
Data: 1 Kd
Activity Spreadsheet -- Enzyme Inhibition Constant Data from BindingDB
Found 1 hit for monomerid = 50423704
Trg + Lig
Ki
nM
ΔG°
kcal/mole
IC50
nM
Kd
nM
EC50/IC50
nM
koff
s-1
kon
M-1s-1
pHTemp
°C
Cysteine synthase
(Haemophilus influenzae (strain ATCC 51907 / DSM 11...)
BDBM50423704
(CHEMBL567022)
Show SMILES CC[C@H](C)[C@H](NC(=O)[C@H](Cc1cnc[nH]1)NC(=O)[C@@H]1CCCN1C(=O)[C@H](CC(N)=O)NC(=O)[C@@H](N)CCSC)C(O)=O |r|
Show InChI InChI=1S/C26H42N8O7S/c1-4-14(2)21(26(40)41)33-23(37)17(10-15-12-29-13-30-15)31-24(38)19-6-5-8-34(19)25(39)18(11-20(28)35)32-22(36)16(27)7-9-42-3/h12-14,16-19,21H,4-11,27H2,1-3H3,(H2,28,35)(H,29,30)(H,31,38)(H,32,36)(H,33,37)(H,40,41)/t14-,16-,17-,18-,19-,21-/m0/s1
n/an/an/a 7.08E+6n/an/an/an/an/a
University of Parma
Curated by ChEMBL
Assay Description
Binding affinity to Haemophilus influenzae O-acetylserine sulfhydrylase expressed in Escherichia coli BL21 (DE3) by fluorescence emission spectra ana...
J Med Chem 53: 345-56 (2010)
Article DOI: 10.1021/jm901325e
BindingDB Entry DOI: 10.7270/Q2QZ2C8P