BDBM50423707 CHEMBL571997
SMILES: CC[C@H](C)[C@H](NC(=O)[C@H](CC(N)=O)NC(=O)[C@H](CC(C)C)NC(=O)[C@H](CC(N)=O)NC(=O)[C@@H](N)CCSC)C(O)=O
InChI Key: InChIKey=CCSLDPRIOIIDEU-QXKNQTRRSA-N
Data: 1 Kd
Activity Spreadsheet -- Enzyme Inhibition Constant Data from BindingDB
Found 1 hit for monomerid = 50423707
Trg + Lig
Ki
nM
ΔG°
kcal/mole
IC50
nM
Kd
nM
EC50/IC50
nM
koff
s-1
kon
M-1s-1
pHTemp
°C
Cysteine synthase
(Haemophilus influenzae (strain ATCC 51907 / DSM 11...)
BDBM50423707
(CHEMBL571997)
Show SMILES CC[C@H](C)[C@H](NC(=O)[C@H](CC(N)=O)NC(=O)[C@H](CC(C)C)NC(=O)[C@H](CC(N)=O)NC(=O)[C@@H](N)CCSC)C(O)=O |r|
Show InChI InChI=1S/C25H45N7O8S/c1-6-13(4)20(25(39)40)32-24(38)17(11-19(28)34)31-22(36)15(9-12(2)3)30-23(37)16(10-18(27)33)29-21(35)14(26)7-8-41-5/h12-17,20H,6-11,26H2,1-5H3,(H2,27,33)(H2,28,34)(H,29,35)(H,30,37)(H,31,36)(H,32,38)(H,39,40)/t13-,14-,15-,16-,17-,20-/m0/s1
n/an/an/a 4.37E+4n/an/an/an/an/a
University of Parma
Curated by ChEMBL
Assay Description
Binding affinity to Haemophilus influenzae O-acetylserine sulfhydrylase expressed in Escherichia coli BL21 (DE3) by fluorescence emission spectra ana...
J Med Chem 53: 345-56 (2010)
Article DOI: 10.1021/jm901325e
BindingDB Entry DOI: 10.7270/Q2QZ2C8P