BDBM50423710 CHEMBL569308
SMILES: CC[C@H](C)[C@H](NC(=O)[C@H](CC(N)=O)NC(=O)[C@H](CCC(O)=O)NC(=O)[C@H](CC(N)=O)NC(=O)[C@@H](N)CCSC)C(O)=O
InChI Key: InChIKey=RAFXPIABHGMUPM-XPIIOQNOSA-N
Data: 1 Kd
Activity Spreadsheet -- Enzyme Inhibition Constant Data from BindingDB
Found 1 hit for monomerid = 50423710
Trg + Lig
Ki
nM
ΔG°
kcal/mole
IC50
nM
Kd
nM
EC50/IC50
nM
koff
s-1
kon
M-1s-1
pHTemp
°C
Cysteine synthase
(Haemophilus influenzae (strain ATCC 51907 / DSM 11...)
BDBM50423710
(CHEMBL569308)
Show SMILES CC[C@H](C)[C@H](NC(=O)[C@H](CC(N)=O)NC(=O)[C@H](CCC(O)=O)NC(=O)[C@H](CC(N)=O)NC(=O)[C@@H](N)CCSC)C(O)=O |r|
Show InChI InChI=1S/C24H41N7O10S/c1-4-11(2)19(24(40)41)31-23(39)15(10-17(27)33)30-21(37)13(5-6-18(34)35)28-22(38)14(9-16(26)32)29-20(36)12(25)7-8-42-3/h11-15,19H,4-10,25H2,1-3H3,(H2,26,32)(H2,27,33)(H,28,38)(H,29,36)(H,30,37)(H,31,39)(H,34,35)(H,40,41)/t11-,12-,13-,14-,15-,19-/m0/s1
n/an/an/a 3.89E+4n/an/an/an/an/a
University of Parma
Curated by ChEMBL
Assay Description
Binding affinity to Haemophilus influenzae O-acetylserine sulfhydrylase expressed in Escherichia coli BL21 (DE3) by fluorescence emission spectra ana...
J Med Chem 53: 345-56 (2010)
Article DOI: 10.1021/jm901325e
BindingDB Entry DOI: 10.7270/Q2QZ2C8P