BDBM50424047 CHEMBL2311571
SMILES: COc1cc2cc(OC3CCN(Cc4ccccc4)CC3)c(=O)oc2cc1OC
InChI Key: InChIKey=RHOYHNRIJFJVBH-UHFFFAOYSA-N
Data: 1 IC50
Activity Spreadsheet -- Enzyme Inhibition Constant Data from BindingDB
Found 1 hit for monomerid = 50424047
Trg + Lig
Ki
nM
ΔG°
kcal/mole
IC50
nM
Kd
nM
EC50/IC50
nM
koff
s-1
kon
M-1s-1
pHTemp
°C
Acetylcholinesterase
(Bos taurus (bovine))
BDBM50424047
(CHEMBL2311571)
Show SMILES COc1cc2cc(OC3CCN(Cc4ccccc4)CC3)c(=O)oc2cc1OC
Show InChI InChI=1S/C23H25NO5/c1-26-20-12-17-13-22(23(25)29-19(17)14-21(20)27-2)28-18-8-10-24(11-9-18)15-16-6-4-3-5-7-16/h3-7,12-14,18H,8-11,15H2,1-2H3
Reactome pathway
n/an/a 1.50E+3n/an/an/an/an/an/a
Universit£ degli Studi di Bari Aldo Moro
Curated by ChEMBL
Assay Description
Inhibition of bovine acetylcholinesterase using acetylcholine iodide as substrate incubated for 20 mins prior to substrate addition meausred after 3 ...
Bioorg Med Chem 21: 146-52 (2012)
Article DOI: 10.1016/j.bmc.2012.10.045
BindingDB Entry DOI: 10.7270/Q2QV3NTH