BDBM50424060 CHEMBL2314427
SMILES: COc1cc2cc(C(=O)NCCN(C)Cc3ccccc3)c(=O)oc2cc1OC
InChI Key: InChIKey=BWVRJRITHBXUPV-UHFFFAOYSA-N
Data: 1 IC50
Activity Spreadsheet -- Enzyme Inhibition Constant Data from BindingDB
Found 1 hit for monomerid = 50424060
Trg + Lig
Ki
nM
ΔG°
kcal/mole
IC50
nM
Kd
nM
EC50/IC50
nM
koff
s-1
kon
M-1s-1
pHTemp
°C
Acetylcholinesterase
(Bos taurus (bovine))
BDBM50424060
(CHEMBL2314427)
Show SMILES COc1cc2cc(C(=O)NCCN(C)Cc3ccccc3)c(=O)oc2cc1OC
Show InChI InChI=1S/C22H24N2O5/c1-24(14-15-7-5-4-6-8-15)10-9-23-21(25)17-11-16-12-19(27-2)20(28-3)13-18(16)29-22(17)26/h4-8,11-13H,9-10,14H2,1-3H3,(H,23,25)
Reactome pathway
n/an/a 9.00E+3n/an/an/an/an/an/a
Universit£ degli Studi di Bari Aldo Moro
Curated by ChEMBL
Assay Description
Inhibition of bovine acetylcholinesterase using acetylcholine iodide as substrate incubated for 20 mins prior to substrate addition meausred after 3 ...
Bioorg Med Chem 21: 146-52 (2012)
Article DOI: 10.1016/j.bmc.2012.10.045
BindingDB Entry DOI: 10.7270/Q2QV3NTH