BDBM50424067 CHEMBL2314738
SMILES: COc1ccc2CC3N(CCc4cc5OCOc5cc34)Cc2c1OC(=O)c1ccccc1OC(C)=O
InChI Key: InChIKey=CDNHSECVYMXQPU-UHFFFAOYSA-N
Data: 1 IC50
Activity Spreadsheet -- Enzyme Inhibition Constant Data from BindingDB
Found 1 hit for monomerid = 50424067
Trg + Lig
Ki
nM
ΔG°
kcal/mole
IC50
nM
Kd
nM
EC50/IC50
nM
koff
s-1
kon
M-1s-1
pHTemp
°C
Coagulation factor VII/tissue factor
(Homo sapiens (Human))
BDBM50424067
(CHEMBL2314738)
Show SMILES COc1ccc2CC3N(CCc4cc5OCOc5cc34)Cc2c1OC(=O)c1ccccc1OC(C)=O
Show InChI InChI=1S/C28H25NO7/c1-16(30)35-23-6-4-3-5-19(23)28(31)36-27-21-14-29-10-9-18-12-25-26(34-15-33-25)13-20(18)22(29)11-17(21)7-8-24(27)32-2/h3-8,12-13,22H,9-11,14-15H2,1-2H3
Reactome pathway
n/an/a 555n/an/an/an/an/an/a
China Pharmaceutical University
Curated by ChEMBL
Assay Description
Inhibition of tissue factor procoagulant activity in LPS-stimulated human THP1 cells preincubated for 1 hr before LPS addition measured after 5 hrs
Bioorg Med Chem 21: 62-9 (2012)
Article DOI: 10.1016/j.bmc.2012.11.002
BindingDB Entry DOI: 10.7270/Q2M32X22