BDBM50424068 CHEMBL2314737
SMILES: COc1ccc2CC3N(CCc4cc5OCOc5cc34)Cc2c1OC(=O)c1ccccc1
InChI Key: InChIKey=CKRCAZQJQIFARK-UHFFFAOYSA-N
Data: 1 IC50
Activity Spreadsheet -- Enzyme Inhibition Constant Data from BindingDB
Found 1 hit for monomerid = 50424068
Trg + Lig
Ki
nM
ΔG°
kcal/mole
IC50
nM
Kd
nM
EC50/IC50
nM
koff
s-1
kon
M-1s-1
pHTemp
°C
Coagulation factor VII/tissue factor
(Homo sapiens (Human))
BDBM50424068
(CHEMBL2314737)
Show SMILES COc1ccc2CC3N(CCc4cc5OCOc5cc34)Cc2c1OC(=O)c1ccccc1
Show InChI InChI=1S/C26H23NO5/c1-29-22-8-7-17-11-21-19-13-24-23(30-15-31-24)12-18(19)9-10-27(21)14-20(17)25(22)32-26(28)16-5-3-2-4-6-16/h2-8,12-13,21H,9-11,14-15H2,1H3
Reactome pathway
n/an/a 377n/an/an/an/an/an/a
China Pharmaceutical University
Curated by ChEMBL
Assay Description
Inhibition of tissue factor procoagulant activity in LPS-stimulated human THP1 cells preincubated for 1 hr before LPS addition measured after 5 hrs
Bioorg Med Chem 21: 62-9 (2012)
Article DOI: 10.1016/j.bmc.2012.11.002
BindingDB Entry DOI: 10.7270/Q2M32X22