BDBM50424070 CHEMBL2314735
SMILES: CCC(=O)Oc1c(OC)ccc2CC3N(CCc4cc5OCOc5cc34)Cc12
InChI Key: InChIKey=GZYOGNGJYUJUBO-UHFFFAOYSA-N
Data: 1 IC50
Activity Spreadsheet -- Enzyme Inhibition Constant Data from BindingDB
Found 1 hit for monomerid = 50424070
Trg + Lig
Ki
nM
ΔG°
kcal/mole
IC50
nM
Kd
nM
EC50/IC50
nM
koff
s-1
kon
M-1s-1
pHTemp
°C
Coagulation factor VII/tissue factor
(Homo sapiens (Human))
BDBM50424070
(CHEMBL2314735)
Show SMILES CCC(=O)Oc1c(OC)ccc2CC3N(CCc4cc5OCOc5cc34)Cc12
Show InChI InChI=1S/C22H23NO5/c1-3-21(24)28-22-16-11-23-7-6-14-9-19-20(27-12-26-19)10-15(14)17(23)8-13(16)4-5-18(22)25-2/h4-5,9-10,17H,3,6-8,11-12H2,1-2H3
Reactome pathway
n/an/a 119n/an/an/an/an/an/a
China Pharmaceutical University
Curated by ChEMBL
Assay Description
Inhibition of tissue factor procoagulant activity in LPS-stimulated human THP1 cells preincubated for 1 hr before LPS addition measured after 5 hrs
Bioorg Med Chem 21: 62-9 (2012)
Article DOI: 10.1016/j.bmc.2012.11.002
BindingDB Entry DOI: 10.7270/Q2M32X22