BDBM50424075 (-)-Corydalmine::CHEMBL448891
SMILES: COc1cc2CCN3Cc4c(C[C@H]3c2cc1OC)ccc(O)c4OC
InChI Key: InChIKey=DIHXHTWYVOYYDC-INIZCTEOSA-N
Data: 8 KI  5 IC50  2 EC50
Activity Spreadsheet -- Enzyme Inhibition Constant Data from BindingDB
Found 15 hits for monomerid = 50424075
Trg + Lig
Ki
nM
ΔG°
kcal/mole
IC50
nM
Kd
nM
EC50/IC50
nM
koff
s-1
kon
M-1s-1
pHTemp
°C
D(1A) dopamine receptor
(Homo sapiens (Human))
BDBM50424075
((-)-Corydalmine | CHEMBL448891)
Show SMILES COc1cc2CCN3Cc4c(C[C@H]3c2cc1OC)ccc(O)c4OC |r|
Show InChI InChI=1S/C20H23NO4/c1-23-18-9-13-6-7-21-11-15-12(4-5-17(22)20(15)25-3)8-16(21)14(13)10-19(18)24-2/h4-5,9-10,16,22H,6-8,11H2,1-3H3/t16-/m0/s1
50n/an/an/an/an/an/an/an/a
Chinese Academy of Sciences
Curated by ChEMBL
Assay Description
Displacement of [3H]SCH23390 from dopamine D1 receptor (unknown origin) expressed in human HEK293 cells by liquid scintillation counter
Bioorg Med Chem 21: 856-68 (2013)
Article DOI: 10.1016/j.bmc.2012.12.016
BindingDB Entry DOI: 10.7270/Q2JD4Z4M
D(1A) dopamine receptor
(Homo sapiens (Human))
BDBM50424075
((-)-Corydalmine | CHEMBL448891)
Show SMILES COc1cc2CCN3Cc4c(C[C@H]3c2cc1OC)ccc(O)c4OC |r|
Show InChI InChI=1S/C20H23NO4/c1-23-18-9-13-6-7-21-11-15-12(4-5-17(22)20(15)25-3)8-16(21)14(13)10-19(18)24-2/h4-5,9-10,16,22H,6-8,11H2,1-3H3/t16-/m0/s1
107n/an/an/an/an/an/an/an/a
Harvard Medical School
Curated by ChEMBL
Assay Description
Displacement of [3H]SCH23390 from human dopamine D1 receptor after 1 hr
Bioorg Med Chem Lett 27: 1437-1440 (2017)
BindingDB Entry DOI: 10.7270/Q24X5B1N
5-hydroxytryptamine receptor 1A
(Homo sapiens (Human))
BDBM50424075
((-)-Corydalmine | CHEMBL448891)
Show SMILES COc1cc2CCN3Cc4c(C[C@H]3c2cc1OC)ccc(O)c4OC |r|
Show InChI InChI=1S/C20H23NO4/c1-23-18-9-13-6-7-21-11-15-12(4-5-17(22)20(15)25-3)8-16(21)14(13)10-19(18)24-2/h4-5,9-10,16,22H,6-8,11H2,1-3H3/t16-/m0/s1
149n/an/an/an/an/an/an/an/a
Chinese Academy of Sciences
Curated by ChEMBL
Assay Description
Displacement of [3H]8-OH-DPAT from 5-HT1A receptor (unknown origin) expressed in HEK293 cells by liquid scintillation counter
Bioorg Med Chem 21: 856-68 (2013)
Article DOI: 10.1016/j.bmc.2012.12.016
BindingDB Entry DOI: 10.7270/Q2JD4Z4M
D(1B) dopamine receptor
(Homo sapiens (Human))
BDBM50424075
((-)-Corydalmine | CHEMBL448891)
Show SMILES COc1cc2CCN3Cc4c(C[C@H]3c2cc1OC)ccc(O)c4OC |r|
Show InChI InChI=1S/C20H23NO4/c1-23-18-9-13-6-7-21-11-15-12(4-5-17(22)20(15)25-3)8-16(21)14(13)10-19(18)24-2/h4-5,9-10,16,22H,6-8,11H2,1-3H3/t16-/m0/s1
242n/an/an/an/an/an/an/an/a
Harvard Medical School
Curated by ChEMBL
Assay Description
Displacement of [3H]SCH23390 from human dopamine D5 receptor after 1 hr
Bioorg Med Chem Lett 27: 1437-1440 (2017)
BindingDB Entry DOI: 10.7270/Q24X5B1N
D(2) dopamine receptor
(Homo sapiens (Human))
BDBM50424075
((-)-Corydalmine | CHEMBL448891)
Show SMILES COc1cc2CCN3Cc4c(C[C@H]3c2cc1OC)ccc(O)c4OC |r|
Show InChI InChI=1S/C20H23NO4/c1-23-18-9-13-6-7-21-11-15-12(4-5-17(22)20(15)25-3)8-16(21)14(13)10-19(18)24-2/h4-5,9-10,16,22H,6-8,11H2,1-3H3/t16-/m0/s1
Reactome pathway
305n/an/an/an/an/an/an/an/a
Chinese Academy of Sciences
Curated by ChEMBL
Assay Description
Displacement of [3H]spiperone from dopamine D2 receptor (unknown origin) expressed in human HEK293 cells by liquid scintillation counter
Bioorg Med Chem 21: 856-68 (2013)
Article DOI: 10.1016/j.bmc.2012.12.016
BindingDB Entry DOI: 10.7270/Q2JD4Z4M
D(2) dopamine receptor
(Homo sapiens (Human))
BDBM50424075
((-)-Corydalmine | CHEMBL448891)
Show SMILES COc1cc2CCN3Cc4c(C[C@H]3c2cc1OC)ccc(O)c4OC |r|
Show InChI InChI=1S/C20H23NO4/c1-23-18-9-13-6-7-21-11-15-12(4-5-17(22)20(15)25-3)8-16(21)14(13)10-19(18)24-2/h4-5,9-10,16,22H,6-8,11H2,1-3H3/t16-/m0/s1
Reactome pathway
533n/an/an/an/an/an/an/an/a
Harvard Medical School
Curated by ChEMBL
Assay Description
Displacement of [3H]N-methylspiperone from human dopamine D2 receptor after 1 hr
Bioorg Med Chem Lett 27: 1437-1440 (2017)
BindingDB Entry DOI: 10.7270/Q24X5B1N
D(4) dopamine receptor
(Homo sapiens (Human))
BDBM50424075
((-)-Corydalmine | CHEMBL448891)
Show SMILES COc1cc2CCN3Cc4c(C[C@H]3c2cc1OC)ccc(O)c4OC |r|
Show InChI InChI=1S/C20H23NO4/c1-23-18-9-13-6-7-21-11-15-12(4-5-17(22)20(15)25-3)8-16(21)14(13)10-19(18)24-2/h4-5,9-10,16,22H,6-8,11H2,1-3H3/t16-/m0/s1
Reactome pathway
>1.00E+3n/an/an/an/an/an/an/an/a
Harvard Medical School
Curated by ChEMBL
Assay Description
Displacement of [3H]N-methylspiperone from human dopamine D4 receptor after 1 hr
Bioorg Med Chem Lett 27: 1437-1440 (2017)
BindingDB Entry DOI: 10.7270/Q24X5B1N
D(3) dopamine receptor
(Homo sapiens (Human))
BDBM50424075
((-)-Corydalmine | CHEMBL448891)
Show SMILES COc1cc2CCN3Cc4c(C[C@H]3c2cc1OC)ccc(O)c4OC |r|
Show InChI InChI=1S/C20H23NO4/c1-23-18-9-13-6-7-21-11-15-12(4-5-17(22)20(15)25-3)8-16(21)14(13)10-19(18)24-2/h4-5,9-10,16,22H,6-8,11H2,1-3H3/t16-/m0/s1
1.71E+3n/an/an/an/an/an/an/an/a
Harvard Medical School
Curated by ChEMBL
Assay Description
Displacement of [3H]N-methylspiperone from human dopamine D3 receptor after 1 hr
Bioorg Med Chem Lett 27: 1437-1440 (2017)
BindingDB Entry DOI: 10.7270/Q24X5B1N
Amine oxidase [flavin-containing] B
(Homo sapiens (Human))
BDBM50424075
((-)-Corydalmine | CHEMBL448891)
Show SMILES COc1cc2CCN3Cc4c(C[C@H]3c2cc1OC)ccc(O)c4OC |r|
Show InChI InChI=1S/C20H23NO4/c1-23-18-9-13-6-7-21-11-15-12(4-5-17(22)20(15)25-3)8-16(21)14(13)10-19(18)24-2/h4-5,9-10,16,22H,6-8,11H2,1-3H3/t16-/m0/s1
n/an/a>2.00E+4n/an/an/an/an/an/a
Sunchon National University
Curated by ChEMBL
Assay Description
Inhibition of recombinant human MAO-B using benzylamine as substrate incubated for 30 mins by spectrophotometric method
Bioorg Med Chem Lett 28: 2403-2407 (2018)
Article DOI: 10.1016/j.bmcl.2018.06.023
BindingDB Entry DOI: 10.7270/Q23R0WCT
Amine oxidase (flavin-containing) A
(Homo sapiens (Human))
BDBM50424075
((-)-Corydalmine | CHEMBL448891)
Show SMILES COc1cc2CCN3Cc4c(C[C@H]3c2cc1OC)ccc(O)c4OC |r|
Show InChI InChI=1S/C20H23NO4/c1-23-18-9-13-6-7-21-11-15-12(4-5-17(22)20(15)25-3)8-16(21)14(13)10-19(18)24-2/h4-5,9-10,16,22H,6-8,11H2,1-3H3/t16-/m0/s1
n/an/a>2.00E+4n/an/an/an/an/an/a
Sunchon National University
Curated by ChEMBL
Assay Description
Inhibition of recombinant human MAO-A using kynuramine as substrate incubated for 20 mins by spectrophotometric method
Bioorg Med Chem Lett 28: 2403-2407 (2018)
Article DOI: 10.1016/j.bmcl.2018.06.023
BindingDB Entry DOI: 10.7270/Q23R0WCT
D(1A) dopamine receptor
(Homo sapiens (Human))
BDBM50424075
((-)-Corydalmine | CHEMBL448891)
Show SMILES COc1cc2CCN3Cc4c(C[C@H]3c2cc1OC)ccc(O)c4OC |r|
Show InChI InChI=1S/C20H23NO4/c1-23-18-9-13-6-7-21-11-15-12(4-5-17(22)20(15)25-3)8-16(21)14(13)10-19(18)24-2/h4-5,9-10,16,22H,6-8,11H2,1-3H3/t16-/m0/s1
n/an/an/an/a 1.35E+3n/an/an/an/a
Chinese Academy of Sciences
Curated by ChEMBL
Assay Description
Agonist activity at dopamine D1 receptor (unknown origin) expressed in HEK293 cells assessed as stimulation of [35S]GTPgammaS binding by scintillatio...
Bioorg Med Chem 21: 856-68 (2013)
Article DOI: 10.1016/j.bmc.2012.12.016
BindingDB Entry DOI: 10.7270/Q2JD4Z4M
D(1A) dopamine receptor
(Homo sapiens (Human))
BDBM50424075
((-)-Corydalmine | CHEMBL448891)
Show SMILES COc1cc2CCN3Cc4c(C[C@H]3c2cc1OC)ccc(O)c4OC |r|
Show InChI InChI=1S/C20H23NO4/c1-23-18-9-13-6-7-21-11-15-12(4-5-17(22)20(15)25-3)8-16(21)14(13)10-19(18)24-2/h4-5,9-10,16,22H,6-8,11H2,1-3H3/t16-/m0/s1
n/an/a 2.13E+4n/an/an/an/an/an/a
Chinese Academy of Sciences
Curated by ChEMBL
Assay Description
Antagonist activity at dopamine D1 receptor (unknown origin) expressed in HEK293 cells assessed as inhibition of [35S]GTPgammaS binding by scintillat...
Bioorg Med Chem 21: 856-68 (2013)
Article DOI: 10.1016/j.bmc.2012.12.016
BindingDB Entry DOI: 10.7270/Q2JD4Z4M
D(2) dopamine receptor
(Homo sapiens (Human))
BDBM50424075
((-)-Corydalmine | CHEMBL448891)
Show SMILES COc1cc2CCN3Cc4c(C[C@H]3c2cc1OC)ccc(O)c4OC |r|
Show InChI InChI=1S/C20H23NO4/c1-23-18-9-13-6-7-21-11-15-12(4-5-17(22)20(15)25-3)8-16(21)14(13)10-19(18)24-2/h4-5,9-10,16,22H,6-8,11H2,1-3H3/t16-/m0/s1
Reactome pathway
n/an/a 1.87E+4n/an/an/an/an/an/a
Chinese Academy of Sciences
Curated by ChEMBL
Assay Description
Antagonist activity at dopamine D2 receptor (unknown origin) expressed in HEK293 cells assessed as inhibition of [35S]GTPgammaS binding by scintillat...
Bioorg Med Chem 21: 856-68 (2013)
Article DOI: 10.1016/j.bmc.2012.12.016
BindingDB Entry DOI: 10.7270/Q2JD4Z4M
Coagulation factor VII/tissue factor
(Homo sapiens (Human))
BDBM50424075
((-)-Corydalmine | CHEMBL448891)
Show SMILES COc1cc2CCN3Cc4c(C[C@H]3c2cc1OC)ccc(O)c4OC |r|
Show InChI InChI=1S/C20H23NO4/c1-23-18-9-13-6-7-21-11-15-12(4-5-17(22)20(15)25-3)8-16(21)14(13)10-19(18)24-2/h4-5,9-10,16,22H,6-8,11H2,1-3H3/t16-/m0/s1
Reactome pathway
n/an/a 152n/an/an/an/an/an/a
China Pharmaceutical University
Curated by ChEMBL
Assay Description
Inhibition of tissue factor procoagulant activity in LPS-stimulated human THP1 cells preincubated for 1 hr before LPS addition measured after 5 hrs
Bioorg Med Chem 21: 62-9 (2012)
Article DOI: 10.1016/j.bmc.2012.11.002
BindingDB Entry DOI: 10.7270/Q2M32X22
5-hydroxytryptamine receptor 1A
(Homo sapiens (Human))
BDBM50424075
((-)-Corydalmine | CHEMBL448891)
Show SMILES COc1cc2CCN3Cc4c(C[C@H]3c2cc1OC)ccc(O)c4OC |r|
Show InChI InChI=1S/C20H23NO4/c1-23-18-9-13-6-7-21-11-15-12(4-5-17(22)20(15)25-3)8-16(21)14(13)10-19(18)24-2/h4-5,9-10,16,22H,6-8,11H2,1-3H3/t16-/m0/s1
n/an/an/an/a 190n/an/an/an/a
Chinese Academy of Sciences
Curated by ChEMBL
Assay Description
Agonist activity at 5-HT1A receptor (unknown origin) expressed in HEK293 cells assessed as inhibition of [35S]GTPgammaS binding by scintillation prox...
Bioorg Med Chem 21: 856-68 (2013)
Article DOI: 10.1016/j.bmc.2012.12.016
BindingDB Entry DOI: 10.7270/Q2JD4Z4M