BDBM50424127 CHEMBL2316354
SMILES: OC(\C=C\c1coc2cccc(OCC3CCCCC3)c2c1=O)c1ccc(F)cc1
InChI Key: InChIKey=FYRVGWOXODMPCS-SDNWHVSQSA-N
Data: 1 IC50
Activity Spreadsheet -- Enzyme Inhibition Constant Data from BindingDB
Found 1 hit for monomerid = 50424127
Trg + Lig
Ki
nM
ΔG°
kcal/mole
IC50
nM
Kd
nM
EC50/IC50
nM
koff
s-1
kon
M-1s-1
pHTemp
°C
Interleukin-5
(Mus musculus)
BDBM50424127
(CHEMBL2316354)
Show SMILES OC(\C=C\c1coc2cccc(OCC3CCCCC3)c2c1=O)c1ccc(F)cc1
Show InChI InChI=1S/C25H25FO4/c26-20-12-9-18(10-13-20)21(27)14-11-19-16-30-23-8-4-7-22(24(23)25(19)28)29-15-17-5-2-1-3-6-17/h4,7-14,16-17,21,27H,1-3,5-6,15H2/b14-11+
Reactome pathway
n/an/a 6.40E+3n/an/an/an/an/an/a
Chungnam National University
Curated by ChEMBL
Assay Description
Inhibition of IL-5 in mouse pro-B Y16 cells after 48 hrs by WST1 assay
Eur J Med Chem 59: 31-8 (2013)
Article DOI: 10.1016/j.ejmech.2012.11.007
BindingDB Entry DOI: 10.7270/Q2PV6MP4