null
SMILES: Cc1ccc(cc1)C(O)\C=C\c1coc2cccc(OCC3CCCCC3)c2c1=O
InChI Key: InChIKey=TUYWTLYYWZMLQR-CCEZHUSRSA-N
Activity Spreadsheet -- Enzyme Inhibition Constant Data from BindingDB
Found 1 hit for monomerid = 50424130
Trg + Lig
Ki
nM
ΔG°
kcal/mole
IC50
nM
Kd
nM
EC50/IC50
nM
koff
s-1
kon
M-1s-1
pHTemp
°C
Interleukin-5
(Mus musculus)
BDBM50424130
(CHEMBL2316351)
Show SMILES Cc1ccc(cc1)C(O)\C=C\c1coc2cccc(OCC3CCCCC3)c2c1=O
Show InChI InChI=1S/C26H28O4/c1-18-10-12-20(13-11-18)22(27)15-14-21-17-30-24-9-5-8-23(25(24)26(21)28)29-16-19-6-3-2-4-7-19/h5,8-15,17,19,22,27H,2-4,6-7,16H2,1H3/b15-14+
Reactome pathway
n/an/a 1.50E+4n/an/an/an/an/an/a
Chungnam National University
Curated by ChEMBL
Assay Description
Inhibition of IL-5 in mouse pro-B Y16 cells after 48 hrs by WST1 assay
Eur J Med Chem 59: 31-8 (2013)
Article DOI: 10.1016/j.ejmech.2012.11.007
BindingDB Entry DOI: 10.7270/Q2PV6MP4