BDBM50424227 CHEMBL2314112
SMILES: CCCCCCNC(=O)Oc1cccc(c1)C1=NCCO1
InChI Key: InChIKey=DOAANJRARCETMX-UHFFFAOYSA-N
Data: 2 IC50
Activity Spreadsheet -- Enzyme Inhibition Constant Data from BindingDB
Found 2 hits for monomerid = 50424227
Trg + Lig
Ki
nM
ΔG°
kcal/mole
IC50
nM
Kd
nM
EC50/IC50
nM
koff
s-1
kon
M-1s-1
pHTemp
°C
Fatty-acid amide hydrolase 1 (aa 30-579)
(Rattus norvegicus (rat))
BDBM50424227
(CHEMBL2314112)
Show SMILES CCCCCCNC(=O)Oc1cccc(c1)C1=NCCO1 |t:17|
Show InChI InChI=1S/C16H22N2O3/c1-2-3-4-5-9-18-16(19)21-14-8-6-7-13(12-14)15-17-10-11-20-15/h6-8,12H,2-5,9-11H2,1H3,(H,18,19)
n/an/a 0.550n/an/an/an/an/an/a
Centre for Addiction and Mental Health
Curated by ChEMBL
Assay Description
Inhibition of FAAH-mediated [3H]anandamide hydrolysis in rat brain homogenate assessed as [3H]ethanolamine production incubated for 90 mins prior to ...
J Med Chem 56: 201-9 (2013)
Article DOI: 10.1021/jm301492y
BindingDB Entry DOI: 10.7270/Q2XD130R
Fatty-acid amide hydrolase 1 (aa 30-579)
(Rattus norvegicus (rat))
BDBM50424227
(CHEMBL2314112)
Show SMILES CCCCCCNC(=O)Oc1cccc(c1)C1=NCCO1 |t:17|
Show InChI InChI=1S/C16H22N2O3/c1-2-3-4-5-9-18-16(19)21-14-8-6-7-13(12-14)15-17-10-11-20-15/h6-8,12H,2-5,9-11H2,1H3,(H,18,19)
n/an/a 1.20n/an/an/an/an/an/a
Centre for Addiction and Mental Health
Curated by ChEMBL
Assay Description
Inhibition of FAAH-mediated [3H]anandamide hydrolysis in rat brain homogenate assessed as [3H]ethanolamine production incubated for 45 mins prior to ...
J Med Chem 56: 201-9 (2013)
Article DOI: 10.1021/jm301492y
BindingDB Entry DOI: 10.7270/Q2XD130R