BDBM50424234 CHEMBL2314131
SMILES: Nc1nc2nc(cnc2c(=O)[nH]1)C(=O)NCC(=O)N[C@@H](Cc1ccccc1)C(=O)N[C@@H](Cc1ccc(O)cc1)C(O)=O
InChI Key: InChIKey=VDAQRRYMKCXFNR-ROUUACIJSA-N
Data: 1 IC50
Activity Spreadsheet -- Enzyme Inhibition Constant Data from BindingDB
Found 1 hit for monomerid = 50424234
Trg + Lig
Ki
nM
ΔG°
kcal/mole
IC50
nM
Kd
nM
EC50/IC50
nM
koff
s-1
kon
M-1s-1
pHTemp
°C
Ricin
(Ricinus communis)
BDBM50424234
(CHEMBL2314131)
Show SMILES Nc1nc2nc(cnc2c(=O)[nH]1)C(=O)NCC(=O)N[C@@H](Cc1ccccc1)C(=O)N[C@@H](Cc1ccc(O)cc1)C(O)=O |r|
Show InChI InChI=1S/C27H26N8O7/c28-27-34-22-21(25(40)35-27)29-12-19(32-22)23(38)30-13-20(37)31-17(10-14-4-2-1-3-5-14)24(39)33-18(26(41)42)11-15-6-8-16(36)9-7-15/h1-9,12,17-18,36H,10-11,13H2,(H,30,38)(H,31,37)(H,33,39)(H,41,42)(H3,28,32,34,35,40)/t17-,18-/m0/s1
n/an/a 2.50E+4n/an/an/an/an/an/a
Toho University
Curated by ChEMBL
Assay Description
Inhibition of Ricin toxin A after 90 mins by luciferase-translational assay
J Med Chem 56: 320-9 (2013)
Article DOI: 10.1021/jm3016393
BindingDB Entry DOI: 10.7270/Q2SN0B81