BDBM50424550 CHEMBL2312519
SMILES: Cc1c(Oc2ccc(cc2F)S(C)(=O)=O)ncnc1N1C2CC3CC1CC(C2)N3C(=O)OC1(C)CC1
InChI Key: InChIKey=OZYVKCFYXTTYJW-UHFFFAOYSA-N
Data: 1 KI  1 EC50
Activity Spreadsheet -- Enzyme Inhibition Constant Data from BindingDB
Found 2 hits for monomerid = 50424550
Trg + Lig
Ki
nM
ΔG°
kcal/mole
IC50
nM
Kd
nM
EC50/IC50
nM
koff
s-1
kon
M-1s-1
pHTemp
°C
G-protein coupled receptor 119 (GPR119)
(Homo sapiens (Human))
BDBM50424550
(CHEMBL2312519)
Show SMILES Cc1c(Oc2ccc(cc2F)S(C)(=O)=O)ncnc1N1C2CC3CC1CC(C2)N3C(=O)OC1(C)CC1 |TLB:27:26:23:21.20.19,19:20:28:25.24.23,19:24:28:21.27.20,18:19:28.26.25:23,THB:27:20:28.26.25:23,29:28:23:21.20.19|
Show InChI InChI=1S/C25H29FN4O5S/c1-14-22(27-13-28-23(14)34-21-5-4-19(12-20(21)26)36(3,32)33)29-15-8-17-10-16(29)11-18(9-15)30(17)24(31)35-25(2)6-7-25/h4-5,12-13,15-18H,6-11H2,1-3H3
131n/an/an/an/an/an/an/an/a
Pfizer Inc.
Curated by ChEMBL
Assay Description
Binding affinity to human GPR119 in HEK293FT cell membrane by radioligand binding assay
J Med Chem 56: 301-19 (2013)
Article DOI: 10.1021/jm301626p
BindingDB Entry DOI: 10.7270/Q2BG2Q91
G-protein coupled receptor 119 (GPR119)
(Homo sapiens (Human))
BDBM50424550
(CHEMBL2312519)
Show SMILES Cc1c(Oc2ccc(cc2F)S(C)(=O)=O)ncnc1N1C2CC3CC1CC(C2)N3C(=O)OC1(C)CC1 |TLB:27:26:23:21.20.19,19:20:28:25.24.23,19:24:28:21.27.20,18:19:28.26.25:23,THB:27:20:28.26.25:23,29:28:23:21.20.19|
Show InChI InChI=1S/C25H29FN4O5S/c1-14-22(27-13-28-23(14)34-21-5-4-19(12-20(21)26)36(3,32)33)29-15-8-17-10-16(29)11-18(9-15)30(17)24(31)35-25(2)6-7-25/h4-5,12-13,15-18H,6-11H2,1-3H3
n/an/an/an/a 169n/an/an/an/a
Pfizer Inc.
Curated by ChEMBL
Assay Description
Agonist activity at human GPR119 in HEK293 cells assessed as cAMP accumulation after 30 mins by CRE-beta-lactamase reporter gene assay
J Med Chem 56: 301-19 (2013)
Article DOI: 10.1021/jm301626p
BindingDB Entry DOI: 10.7270/Q2BG2Q91