BDBM50424562 CHEMBL2312504
SMILES: CCc1c(Oc2cccnc2C)ncnc1N1C2CC3CC1CC(C2)N3C(=O)OC(C)C
InChI Key: InChIKey=DOWXMMWWWTZBDA-UHFFFAOYSA-N
Data: 1 KI  1 EC50
Activity Spreadsheet -- Enzyme Inhibition Constant Data from BindingDB
Found 2 hits for monomerid = 50424562
Trg + Lig
Ki
nM
ΔG°
kcal/mole
IC50
nM
Kd
nM
EC50/IC50
nM
koff
s-1
kon
M-1s-1
pHTemp
°C
G-protein coupled receptor 119 (GPR119)
(Homo sapiens (Human))
BDBM50424562
(CHEMBL2312504)
Show SMILES CCc1c(Oc2cccnc2C)ncnc1N1C2CC3CC1CC(C2)N3C(=O)OC(C)C |TLB:24:23:20:18.17.16,16:17:25:22.21.20,16:21:25:18.24.17,15:16:25.23.22:20,THB:24:17:25.23.22:20,26:25:20:18.17.16|
Show InChI InChI=1S/C24H31N5O3/c1-5-20-22(26-13-27-23(20)32-21-7-6-8-25-15(21)4)28-16-9-18-11-17(28)12-19(10-16)29(18)24(30)31-14(2)3/h6-8,13-14,16-19H,5,9-12H2,1-4H3
197n/an/an/an/an/an/an/an/a
Pfizer Inc.
Curated by ChEMBL
Assay Description
Binding affinity to human GPR119 in HEK293FT cell membrane by radioligand binding assay
J Med Chem 56: 301-19 (2013)
Article DOI: 10.1021/jm301626p
BindingDB Entry DOI: 10.7270/Q2BG2Q91
G-protein coupled receptor 119 (GPR119)
(Homo sapiens (Human))
BDBM50424562
(CHEMBL2312504)
Show SMILES CCc1c(Oc2cccnc2C)ncnc1N1C2CC3CC1CC(C2)N3C(=O)OC(C)C |TLB:24:23:20:18.17.16,16:17:25:22.21.20,16:21:25:18.24.17,15:16:25.23.22:20,THB:24:17:25.23.22:20,26:25:20:18.17.16|
Show InChI InChI=1S/C24H31N5O3/c1-5-20-22(26-13-27-23(20)32-21-7-6-8-25-15(21)4)28-16-9-18-11-17(28)12-19(10-16)29(18)24(30)31-14(2)3/h6-8,13-14,16-19H,5,9-12H2,1-4H3
n/an/an/an/a 164n/an/an/an/a
Pfizer Inc.
Curated by ChEMBL
Assay Description
Agonist activity at human GPR119 in HEK293 cells assessed as cAMP accumulation after 30 mins by CRE-beta-lactamase reporter gene assay
J Med Chem 56: 301-19 (2013)
Article DOI: 10.1021/jm301626p
BindingDB Entry DOI: 10.7270/Q2BG2Q91