BDBM50424572 CHEMBL2312162
SMILES: Cc1ncn(n1)-c1ccc(Oc2ncnc(N3C4CC5CC3CC(C4)N5C(=O)OC(C)(C)C)c2C)cc1
InChI Key: InChIKey=OLHPKUPQTKGJTN-UHFFFAOYSA-N
Data: 1 KI  1 EC50
Activity Spreadsheet -- Enzyme Inhibition Constant Data from BindingDB
Found 2 hits for monomerid = 50424572
Trg + Lig
Ki
nM
ΔG°
kcal/mole
IC50
nM
Kd
nM
EC50/IC50
nM
koff
s-1
kon
M-1s-1
pHTemp
°C
G-protein coupled receptor 119 (GPR119)
(Homo sapiens (Human))
BDBM50424572
(CHEMBL2312162)
Show SMILES Cc1ncn(n1)-c1ccc(Oc2ncnc(N3C4CC5CC3CC(C4)N5C(=O)OC(C)(C)C)c2C)cc1 |TLB:24:23:20:18.17.16,16:17:25:22.21.20,16:21:25:18.24.17,15:16:25.23.22:20,THB:24:17:25.23.22:20,26:25:20:18.17.16|
Show InChI InChI=1S/C27H33N7O3/c1-16-24(28-14-29-25(16)36-23-8-6-18(7-9-23)32-15-30-17(2)31-32)33-19-10-21-12-20(33)13-22(11-19)34(21)26(35)37-27(3,4)5/h6-9,14-15,19-22H,10-13H2,1-5H3
948n/an/an/an/an/an/an/an/a
Pfizer Inc.
Curated by ChEMBL
Assay Description
Binding affinity to human GPR119 in HEK293FT cell membrane by radioligand binding assay
J Med Chem 56: 301-19 (2013)
Article DOI: 10.1021/jm301626p
BindingDB Entry DOI: 10.7270/Q2BG2Q91
G-protein coupled receptor 119 (GPR119)
(Homo sapiens (Human))
BDBM50424572
(CHEMBL2312162)
Show SMILES Cc1ncn(n1)-c1ccc(Oc2ncnc(N3C4CC5CC3CC(C4)N5C(=O)OC(C)(C)C)c2C)cc1 |TLB:24:23:20:18.17.16,16:17:25:22.21.20,16:21:25:18.24.17,15:16:25.23.22:20,THB:24:17:25.23.22:20,26:25:20:18.17.16|
Show InChI InChI=1S/C27H33N7O3/c1-16-24(28-14-29-25(16)36-23-8-6-18(7-9-23)32-15-30-17(2)31-32)33-19-10-21-12-20(33)13-22(11-19)34(21)26(35)37-27(3,4)5/h6-9,14-15,19-22H,10-13H2,1-5H3
n/an/an/an/a>8.51E+3n/an/an/an/a
Pfizer Inc.
Curated by ChEMBL
Assay Description
Agonist activity at human GPR119 in HEK293 cells assessed as cAMP accumulation after 30 mins by CRE-beta-lactamase reporter gene assay
J Med Chem 56: 301-19 (2013)
Article DOI: 10.1021/jm301626p
BindingDB Entry DOI: 10.7270/Q2BG2Q91