BDBM50424579 CHEMBL2312156
SMILES: Cc1c(Oc2ccc(cc2)-n2cnnn2)ncnc1N1C2CC3CC1CC(C2)N3C(=O)OC(C)(C)C
InChI Key: InChIKey=PDXPPBBOOBHYGL-UHFFFAOYSA-N
Data: 1 KI  1 EC50
Activity Spreadsheet -- Enzyme Inhibition Constant Data from BindingDB
Found 2 hits for monomerid = 50424579
Trg + Lig
Ki
nM
ΔG°
kcal/mole
IC50
nM
Kd
nM
EC50/IC50
nM
koff
s-1
kon
M-1s-1
pHTemp
°C
G-protein coupled receptor 119 (GPR119)
(Homo sapiens (Human))
BDBM50424579
(CHEMBL2312156)
Show SMILES Cc1c(Oc2ccc(cc2)-n2cnnn2)ncnc1N1C2CC3CC1CC(C2)N3C(=O)OC(C)(C)C |TLB:27:26:23:21.20.19,19:20:28:25.24.23,19:24:28:21.27.20,18:19:28.26.25:23,THB:27:20:28.26.25:23,29:28:23:21.20.19|
Show InChI InChI=1S/C25H30N8O3/c1-15-22(26-13-27-23(15)35-21-7-5-16(6-8-21)31-14-28-29-30-31)32-17-9-19-11-18(32)12-20(10-17)33(19)24(34)36-25(2,3)4/h5-8,13-14,17-20H,9-12H2,1-4H3
21n/an/an/an/an/an/an/an/a
Pfizer Inc.
Curated by ChEMBL
Assay Description
Binding affinity to human GPR119 in HEK293FT cell membrane by radioligand binding assay
J Med Chem 56: 301-19 (2013)
Article DOI: 10.1021/jm301626p
BindingDB Entry DOI: 10.7270/Q2BG2Q91
G-protein coupled receptor 119 (GPR119)
(Homo sapiens (Human))
BDBM50424579
(CHEMBL2312156)
Show SMILES Cc1c(Oc2ccc(cc2)-n2cnnn2)ncnc1N1C2CC3CC1CC(C2)N3C(=O)OC(C)(C)C |TLB:27:26:23:21.20.19,19:20:28:25.24.23,19:24:28:21.27.20,18:19:28.26.25:23,THB:27:20:28.26.25:23,29:28:23:21.20.19|
Show InChI InChI=1S/C25H30N8O3/c1-15-22(26-13-27-23(15)35-21-7-5-16(6-8-21)31-14-28-29-30-31)32-17-9-19-11-18(32)12-20(10-17)33(19)24(34)36-25(2,3)4/h5-8,13-14,17-20H,9-12H2,1-4H3
n/an/an/an/a 17n/an/an/an/a
Pfizer Inc.
Curated by ChEMBL
Assay Description
Agonist activity at human GPR119 in HEK293 cells assessed as cAMP accumulation after 30 mins by CRE-beta-lactamase reporter gene assay
J Med Chem 56: 301-19 (2013)
Article DOI: 10.1021/jm301626p
BindingDB Entry DOI: 10.7270/Q2BG2Q91