BDBM50424584 CHEMBL2312530
SMILES: OC(=O)Cc1csc(=NC(=O)CS(=O)(=O)Cc2ccc3ccccc3c2)n1O
InChI Key: InChIKey=QNCNQHCDQMPPGD-UHFFFAOYSA-N
Data: 1 IC50  2 Kd
Activity Spreadsheet -- Enzyme Inhibition Constant Data from BindingDB
Found 3 hits for monomerid = 50424584
Trg + Lig
Ki
nM
ΔG°
kcal/mole
IC50
nM
Kd
nM
EC50/IC50
nM
koff
s-1
kon
M-1s-1
pHTemp
°C
Egl nine homolog 1
(Homo sapiens (Human))
BDBM50424584
(CHEMBL2312530)
Show SMILES OC(=O)Cc1csc(=NC(=O)CS(=O)(=O)Cc2ccc3ccccc3c2)n1O |w:8.8|
Show InChI InChI=1S/C18H16N2O6S2/c21-16(19-18-20(24)15(9-27-18)8-17(22)23)11-28(25,26)10-12-5-6-13-3-1-2-4-14(13)7-12/h1-7,9,24H,8,10-11H2,(H,22,23)
Reactome pathway
n/an/a 20n/an/an/an/an/an/a
University of Oxford
Curated by ChEMBL
Assay Description
Inhibition of human PHD2 catalytic domain (181 to 426) Mn2 expressed in Escherichia coli by NMR spectroscopic analysis
J Med Chem 56: 547-55 (2013)
Article DOI: 10.1021/jm301583m
BindingDB Entry DOI: 10.7270/Q26Q1ZJV
Egl nine homolog 1
(Homo sapiens (Human))
BDBM50424584
(CHEMBL2312530)
Show SMILES OC(=O)Cc1csc(=NC(=O)CS(=O)(=O)Cc2ccc3ccccc3c2)n1O |w:8.8|
Show InChI InChI=1S/C18H16N2O6S2/c21-16(19-18-20(24)15(9-27-18)8-17(22)23)11-28(25,26)10-12-5-6-13-3-1-2-4-14(13)7-12/h1-7,9,24H,8,10-11H2,(H,22,23)
Reactome pathway
n/an/an/a 110n/an/an/an/an/a
University of Oxford
Curated by ChEMBL
Assay Description
Displacement of [13C]-2OG from catalytic domain of PHD2 (181 to 426) (unknown origin) expressed in Escherichia coli
J Med Chem 56: 547-55 (2013)
Article DOI: 10.1021/jm301583m
BindingDB Entry DOI: 10.7270/Q26Q1ZJV
Egl nine homolog 1
(Homo sapiens (Human))
BDBM50424584
(CHEMBL2312530)
Show SMILES OC(=O)Cc1csc(=NC(=O)CS(=O)(=O)Cc2ccc3ccccc3c2)n1O |w:8.8|
Show InChI InChI=1S/C18H16N2O6S2/c21-16(19-18-20(24)15(9-27-18)8-17(22)23)11-28(25,26)10-12-5-6-13-3-1-2-4-14(13)7-12/h1-7,9,24H,8,10-11H2,(H,22,23)
Reactome pathway
n/an/an/a 100n/an/an/an/an/a
University of Oxford
Curated by ChEMBL
Assay Description
Binding affinity to human PHD2 catalytic domain (181 to 426) Mn2 expressed in Escherichia coli by NMR spectroscopic analysis
J Med Chem 56: 547-55 (2013)
Article DOI: 10.1021/jm301583m
BindingDB Entry DOI: 10.7270/Q26Q1ZJV