BDBM50424936 CHEMBL2315433
SMILES: CC(=O)c1ccc(cc1)-c1ccc(OCc2nnc(SC3CCCC3)n2-c2cccnc2)cc1
InChI Key: InChIKey=NIDZBNQACWCBOS-UHFFFAOYSA-N
Data: 1 IC50
Activity Spreadsheet -- Enzyme Inhibition Constant Data from BindingDB
Found 1 hit for monomerid = 50424936
Trg + Lig
Ki
nM
ΔG°
kcal/mole
IC50
nM
Kd
nM
EC50/IC50
nM
koff
s-1
kon
M-1s-1
pHTemp
°C
Valosin containing protein, p97 subunit
(Homo sapiens (Human))
BDBM50424936
(CHEMBL2315433)
Show SMILES CC(=O)c1ccc(cc1)-c1ccc(OCc2nnc(SC3CCCC3)n2-c2cccnc2)cc1
Show InChI InChI=1S/C27H26N4O2S/c1-19(32)20-8-10-21(11-9-20)22-12-14-24(15-13-22)33-18-26-29-30-27(34-25-6-2-3-7-25)31(26)23-5-4-16-28-17-23/h4-5,8-17,25H,2-3,6-7,18H2,1H3
n/an/a 65n/an/an/an/an/an/a
TBA
Curated by ChEMBL
Assay Description
Inhibition of human recombinant His-GST tagged VCP expressed in baculovirus infected Hi5 cells assessed as ADP formation incubated for 20 mins proir ...
J Med Chem 56: 437-50 (2013)
Article DOI: 10.1021/jm3013213
BindingDB Entry DOI: 10.7270/Q21Z45QK