BDBM50425046 CHEMBL2312571::US9402842, 23
SMILES: COC(=O)CC(=O)Nc1ccc2c3C(=O)c4ccccc4-c3n(CCCN)c(=O)c2c1
InChI Key: InChIKey=WPRKQIRWRMVZPA-UHFFFAOYSA-N
Data: 2 IC50  1 EC50
Activity Spreadsheet -- Enzyme Inhibition Constant Data from BindingDB
Found 3 hits for monomerid = 50425046
Trg + Lig
Ki
nM
ΔG°
kcal/mole
IC50
nM
Kd
nM
EC50/IC50
nM
koff
s-1
kon
M-1s-1
pHTemp
°C
Tyrosyl-DNA phosphodiesterase 1 (TDP1)
(Homo sapiens (Human))
BDBM50425046
(CHEMBL2312571 | US9402842, 23)
Show SMILES COC(=O)CC(=O)Nc1ccc2c3C(=O)c4ccccc4-c3n(CCCN)c(=O)c2c1
Show InChI InChI=1S/C23H21N3O5/c1-31-19(28)12-18(27)25-13-7-8-14-17(11-13)23(30)26(10-4-9-24)21-15-5-2-3-6-16(15)22(29)20(14)21/h2-3,5-8,11H,4,9-10,12,24H2,1H3,(H,25,27)
US Patent
n/an/a 1.80E+4n/an/an/an/a7.525
Purdue Research Foundation
US Patent
Assay Description
A 5′-[32P]-labeled single-stranded DNA oligonucleotide containing a 3′-phosphotyrosine (N14Y) was generated as described by Dexheimer et ...
US Patent US9402842 (2016)
BindingDB Entry DOI: 10.7270/Q2H41Q9R
Retinoic acid receptor RXR-alpha
(Homo sapiens (Human))
BDBM50425046
(CHEMBL2312571 | US9402842, 23)
Show SMILES COC(=O)CC(=O)Nc1ccc2c3C(=O)c4ccccc4-c3n(CCCN)c(=O)c2c1
Show InChI InChI=1S/C23H21N3O5/c1-31-19(28)12-18(27)25-13-7-8-14-17(11-13)23(30)26(10-4-9-24)21-15-5-2-3-6-16(15)22(29)20(14)21/h2-3,5-8,11H,4,9-10,12,24H2,1H3,(H,25,27)
NCI pathway
Reactome pathway
n/an/an/an/a>4.45E+4n/an/an/an/a
Purdue University
Curated by ChEMBL
Assay Description
Activation of human RXRalpha activity expressed in COS1 cells after 12 hrs by RXRE-luciferase reporter gene assay
J Med Chem 56: 2581-605 (2013)
Article DOI: 10.1021/jm400026k
BindingDB Entry DOI: 10.7270/Q2G44RNG
Tyrosyl-DNA phosphodiesterase 1 (TDP1)
(Homo sapiens (Human))
BDBM50425046
(CHEMBL2312571 | US9402842, 23)
Show SMILES COC(=O)CC(=O)Nc1ccc2c3C(=O)c4ccccc4-c3n(CCCN)c(=O)c2c1
Show InChI InChI=1S/C23H21N3O5/c1-31-19(28)12-18(27)25-13-7-8-14-17(11-13)23(30)26(10-4-9-24)21-15-5-2-3-6-16(15)22(29)20(14)21/h2-3,5-8,11H,4,9-10,12,24H2,1H3,(H,25,27)
n/an/a 1.80E+4n/an/an/an/an/an/a
Purdue University
Curated by ChEMBL
Assay Description
Inhibition of recombinant Tdp1 (unknown origin) using 5'-[32P]-labeled single-stranded DNA oligonucleotide containing 3'-phosphotyrosine as substrate...
J Med Chem 56: 182-200 (2013)
Article DOI: 10.1021/jm3014458
BindingDB Entry DOI: 10.7270/Q2MS3V3Z