BDBM50425156 CHEMBL2313273
SMILES: CC(=O)N1CC2CC1CN2Cc1coc2cc(Oc3nc4cnccc4s3)ccc12
InChI Key: InChIKey=FCVJBHCSSQVABJ-UHFFFAOYSA-N
Data: 1 IC50
Activity Spreadsheet -- Enzyme Inhibition Constant Data from BindingDB
Found 1 hit for monomerid = 50425156
Trg + Lig
Ki
nM
ΔG°
kcal/mole
IC50
nM
Kd
nM
EC50/IC50
nM
koff
s-1
kon
M-1s-1
pHTemp
°C
Leukotriene A4 hydrolase
(Homo sapiens (Human))
BDBM50425156
(CHEMBL2313273)
Show SMILES CC(=O)N1CC2CC1CN2Cc1coc2cc(Oc3nc4cnccc4s3)ccc12
Show InChI InChI=1S/C22H20N4O3S/c1-13(27)26-11-15-6-16(26)10-25(15)9-14-12-28-20-7-17(2-3-18(14)20)29-22-24-19-8-23-5-4-21(19)30-22/h2-5,7-8,12,15-16H,6,9-11H2,1H3
Reactome pathway
n/an/a 340n/an/an/an/an/an/a
Janssen Research& Development, LLC
Curated by ChEMBL
Assay Description
Inhibition of recombinant human LTA4H expressed in Sf9 cells using LTA4 as substrate incubated for 10 mins prior to substrate addition measured after...
Bioorg Med Chem Lett 23: 811-5 (2013)
Article DOI: 10.1016/j.bmcl.2012.11.074
BindingDB Entry DOI: 10.7270/Q27H1KW1