BDBM50425178 CHEMBL2313588
SMILES: CCOc1ccc2nc(N=C(CC(=O)c3ccc(Cl)cc3)SC)sc2c1
InChI Key: InChIKey=MFEAREKHJXIKFB-UHFFFAOYSA-N
Data: 1 IC50
Activity Spreadsheet -- Enzyme Inhibition Constant Data from BindingDB
Found 1 hit for monomerid = 50425178
Trg + Lig
Ki
nM
ΔG°
kcal/mole
IC50
nM
Kd
nM
EC50/IC50
nM
koff
s-1
kon
M-1s-1
pHTemp
°C
Pancreatic alpha-amylase
(Sus scrofa (Pig))
BDBM50425178
(CHEMBL2313588)
Show SMILES CCOc1ccc2nc(N=C(CC(=O)c3ccc(Cl)cc3)SC)sc2c1 |w:9.8|
Show InChI InChI=1S/C19H17ClN2O2S2/c1-3-24-14-8-9-15-17(10-14)26-19(21-15)22-18(25-2)11-16(23)12-4-6-13(20)7-5-12/h4-10H,3,11H2,1-2H3
n/an/a 1.79E+4n/an/an/an/an/an/a
North Maharashtra University
Curated by ChEMBL
Assay Description
Inhibition of pig pancreatic alpha-amylase by Bernfeld method
Eur J Med Chem 59: 304-9 (2013)
Article DOI: 10.1016/j.ejmech.2012.11.020
BindingDB Entry DOI: 10.7270/Q2028SV2