BDBM50425340 CHEMBL2316477
SMILES: Fc1ccc(Nc2ccc3c(CCc4ccc(cc4C3=O)C(=O)NCCN3CCOCC3)c2)c(F)c1
InChI Key: InChIKey=VMFNQUXLGZVDCW-UHFFFAOYSA-N
Data: 2 IC50
Activity Spreadsheet -- Enzyme Inhibition Constant Data from BindingDB
Found 2 hits for monomerid = 50425340
Trg + Lig
Ki
nM
ΔG°
kcal/mole
IC50
nM
Kd
nM
EC50/IC50
nM
koff
s-1
kon
M-1s-1
pHTemp
°C
Mitogen-activated protein kinase 14
(Homo sapiens (Human))
BDBM50425340
(CHEMBL2316477)
Show SMILES Fc1ccc(Nc2ccc3c(CCc4ccc(cc4C3=O)C(=O)NCCN3CCOCC3)c2)c(F)c1
Show InChI InChI=1S/C28H27F2N3O3/c29-21-5-8-26(25(30)17-21)32-22-6-7-23-19(15-22)3-1-18-2-4-20(16-24(18)27(23)34)28(35)31-9-10-33-11-13-36-14-12-33/h2,4-8,15-17,32H,1,3,9-14H2,(H,31,35)
NCI pathway
Reactome pathway
n/an/a 29n/an/an/an/an/an/a
University of T£bingen
Curated by ChEMBL
Assay Description
Inhibition of p38alpha MAP kinase in whole blood (unknown origin) assessed as lipopolysaccharide-stimulated TNF-alpha release by ELISA
J Med Chem 56: 241-53 (2013)
Article DOI: 10.1021/jm301539x
BindingDB Entry DOI: 10.7270/Q2TB187B
Mitogen-activated protein kinase 14
(Homo sapiens (Human))
BDBM50425340
(CHEMBL2316477)
Show SMILES Fc1ccc(Nc2ccc3c(CCc4ccc(cc4C3=O)C(=O)NCCN3CCOCC3)c2)c(F)c1
Show InChI InChI=1S/C28H27F2N3O3/c29-21-5-8-26(25(30)17-21)32-22-6-7-23-19(15-22)3-1-18-2-4-20(16-24(18)27(23)34)28(35)31-9-10-33-11-13-36-14-12-33/h2,4-8,15-17,32H,1,3,9-14H2,(H,31,35)
NCI pathway
Reactome pathway
n/an/a 3n/an/an/an/an/an/a
University of T£bingen
Curated by ChEMBL
Assay Description
Inhibition of p38alpha MAP kinase (unknown origin) by ELISA
J Med Chem 56: 241-53 (2013)
Article DOI: 10.1021/jm301539x
BindingDB Entry DOI: 10.7270/Q2TB187B