BDBM50425355 CHEMBL2316494
SMILES: Cc1cc(F)c(NC(=O)c2ccoc2)cc1Nc1ccc2c(CCc3ccc(OCCN4CCOCC4)cc3C2=O)c1
InChI Key: InChIKey=OKAWVBPTOGVXNS-UHFFFAOYSA-N
Data: 2 IC50
Activity Spreadsheet -- Enzyme Inhibition Constant Data from BindingDB
Found 2 hits for monomerid = 50425355
Trg + Lig
Ki
nM
ΔG°
kcal/mole
IC50
nM
Kd
nM
EC50/IC50
nM
koff
s-1
kon
M-1s-1
pHTemp
°C
Mitogen-activated protein kinase 14
(Homo sapiens (Human))
BDBM50425355
(CHEMBL2316494)
Show SMILES Cc1cc(F)c(NC(=O)c2ccoc2)cc1Nc1ccc2c(CCc3ccc(OCCN4CCOCC4)cc3C2=O)c1
Show InChI InChI=1S/C33H32FN3O5/c1-21-16-29(34)31(36-33(39)24-8-12-41-20-24)19-30(21)35-25-5-7-27-23(17-25)3-2-22-4-6-26(18-28(22)32(27)38)42-15-11-37-9-13-40-14-10-37/h4-8,12,16-20,35H,2-3,9-11,13-15H2,1H3,(H,36,39)
NCI pathway
Reactome pathway
n/an/a 32n/an/an/an/an/an/a
University of T£bingen
Curated by ChEMBL
Assay Description
Inhibition of p38alpha MAP kinase in whole blood (unknown origin) assessed as lipopolysaccharide-stimulated TNF-alpha release by ELISA
J Med Chem 56: 241-53 (2013)
Article DOI: 10.1021/jm301539x
BindingDB Entry DOI: 10.7270/Q2TB187B
Mitogen-activated protein kinase 14
(Homo sapiens (Human))
BDBM50425355
(CHEMBL2316494)
Show SMILES Cc1cc(F)c(NC(=O)c2ccoc2)cc1Nc1ccc2c(CCc3ccc(OCCN4CCOCC4)cc3C2=O)c1
Show InChI InChI=1S/C33H32FN3O5/c1-21-16-29(34)31(36-33(39)24-8-12-41-20-24)19-30(21)35-25-5-7-27-23(17-25)3-2-22-4-6-26(18-28(22)32(27)38)42-15-11-37-9-13-40-14-10-37/h4-8,12,16-20,35H,2-3,9-11,13-15H2,1H3,(H,36,39)
NCI pathway
Reactome pathway
n/an/a 1n/an/an/an/an/an/a
University of T£bingen
Curated by ChEMBL
Assay Description
Inhibition of p38alpha MAP kinase (unknown origin) by ELISA
J Med Chem 56: 241-53 (2013)
Article DOI: 10.1021/jm301539x
BindingDB Entry DOI: 10.7270/Q2TB187B