BDBM50425542 CHEMBL2313636
SMILES: Cc1cc(C)c(Nc2cc(Cl)cc(Cl)c2)c(C)c1
InChI Key: InChIKey=USBLJXIMISZXSQ-UHFFFAOYSA-N
Data: 1 IC50
Activity Spreadsheet -- Enzyme Inhibition Constant Data from BindingDB
Found 1 hit for monomerid = 50425542
Trg + Lig
Ki
nM
ΔG°
kcal/mole
IC50
nM
Kd
nM
EC50/IC50
nM
koff
s-1
kon
M-1s-1
pHTemp
°C
Rap guanine nucleotide exchange factor 4
(Homo sapiens (Human))
BDBM50425542
(CHEMBL2313636)
Show SMILES Cc1cc(C)c(Nc2cc(Cl)cc(Cl)c2)c(C)c1
Show InChI InChI=1S/C15H15Cl2N/c1-9-4-10(2)15(11(3)5-9)18-14-7-12(16)6-13(17)8-14/h4-8,18H,1-3H3
Reactome pathway
n/an/a 900n/an/an/an/an/an/a
University of Texas Medical Branch
Curated by ChEMBL
Assay Description
Antagonist activity at recombinant EPAC2 (unknown origin) assessed 8-NBD-cAMP substrate fluorescence intensity by substrate competing assay
J Med Chem 56: 952-62 (2013)
Article DOI: 10.1021/jm3014162
BindingDB Entry DOI: 10.7270/Q2D21ZX3