null
SMILES: CN(c1ncccc1CNc1c(cnc2[nH]c(cc12)-c1ccnc(C)c1)C#N)S(C)(=O)=O
InChI Key: InChIKey=UPABBOVWARPMGK-UHFFFAOYSA-N
Activity Spreadsheet -- Enzyme Inhibition Constant Data from BindingDB
Found 3 hits for monomerid = 50425667
Trg + Lig
Ki
nM
ΔG°
kcal/mole
IC50
nM
Kd
nM
EC50/IC50
nM
koff
s-1
kon
M-1s-1
pHTemp
°C
Focal adhesion kinase 1
(Homo sapiens (Human))
BDBM50425667
(CHEMBL2315583)
Show SMILES CN(c1ncccc1CNc1c(cnc2[nH]c(cc12)-c1ccnc(C)c1)C#N)S(C)(=O)=O
Show InChI InChI=1S/C22H21N7O2S/c1-14-9-15(6-8-24-14)19-10-18-20(17(11-23)13-27-21(18)28-19)26-12-16-5-4-7-25-22(16)29(2)32(3,30)31/h4-10,13H,12H2,1-3H3,(H2,26,27,28)
NCI pathway
Reactome pathway
n/an/a 6.50E+3n/an/an/an/an/an/a
Merck Serono Research
Curated by ChEMBL
Assay Description
Inhibition of FAK in human HT-29 cells assessed as phosphorylation at tyrosine 397 after 45 mins
J Med Chem 56: 1160-70 (2013)
Article DOI: 10.1021/jm3016014
BindingDB Entry DOI: 10.7270/Q2GT5PGP
Focal adhesion kinase 1
(Homo sapiens (Human))
BDBM50425667
(CHEMBL2315583)
Show SMILES CN(c1ncccc1CNc1c(cnc2[nH]c(cc12)-c1ccnc(C)c1)C#N)S(C)(=O)=O
Show InChI InChI=1S/C22H21N7O2S/c1-14-9-15(6-8-24-14)19-10-18-20(17(11-23)13-27-21(18)28-19)26-12-16-5-4-7-25-22(16)29(2)32(3,30)31/h4-10,13H,12H2,1-3H3,(H2,26,27,28)
NCI pathway
Reactome pathway
n/an/an/a 24n/an/an/an/an/a
Merck Serono Research
Curated by ChEMBL
Assay Description
Binding affinity to FAK (unknown origin) by surface plasmon resonance analysis
J Med Chem 56: 1160-70 (2013)
Article DOI: 10.1021/jm3016014
BindingDB Entry DOI: 10.7270/Q2GT5PGP
Focal adhesion kinase 1
(Homo sapiens (Human))
BDBM50425667
(CHEMBL2315583)
Show SMILES CN(c1ncccc1CNc1c(cnc2[nH]c(cc12)-c1ccnc(C)c1)C#N)S(C)(=O)=O
Show InChI InChI=1S/C22H21N7O2S/c1-14-9-15(6-8-24-14)19-10-18-20(17(11-23)13-27-21(18)28-19)26-12-16-5-4-7-25-22(16)29(2)32(3,30)31/h4-10,13H,12H2,1-3H3,(H2,26,27,28)
NCI pathway
Reactome pathway
n/an/a 220n/an/an/an/an/an/a
Merck Serono Research
Curated by ChEMBL
Assay Description
Inhibition of FAK (unknown origin) using biotinylated His-TEV-hsFAK(31-686)(K454R) substrate after 2 hrs by scintillation counting analysis
J Med Chem 56: 1160-70 (2013)
Article DOI: 10.1021/jm3016014
BindingDB Entry DOI: 10.7270/Q2GT5PGP