null
SMILES: CNC(=O)c1ccccc1Nc1c(cnc2[nH]c(cc12)-c1ccc(F)cc1)C#N
InChI Key: InChIKey=KTPJZSHOXLWCOW-UHFFFAOYSA-N
Activity Spreadsheet -- Enzyme Inhibition Constant Data from BindingDB
Found 3 hits for monomerid = 50425681
Trg + Lig
Ki
nM
ΔG°
kcal/mole
IC50
nM
Kd
nM
EC50/IC50
nM
koff
s-1
kon
M-1s-1
pHTemp
°C
Focal adhesion kinase 1
(Homo sapiens (Human))
BDBM50425681
(CHEMBL2315564)
Show SMILES CNC(=O)c1ccccc1Nc1c(cnc2[nH]c(cc12)-c1ccc(F)cc1)C#N
Show InChI InChI=1S/C22H16FN5O/c1-25-22(29)16-4-2-3-5-18(16)27-20-14(11-24)12-26-21-17(20)10-19(28-21)13-6-8-15(23)9-7-13/h2-10,12H,1H3,(H,25,29)(H2,26,27,28)
NCI pathway
Reactome pathway
n/an/a 365n/an/an/an/an/an/a
Merck Serono Research
Curated by ChEMBL
Assay Description
Inhibition of FAK in human HT-29 cells assessed as phosphorylation at tyrosine 397 after 45 mins
J Med Chem 56: 1160-70 (2013)
Article DOI: 10.1021/jm3016014
BindingDB Entry DOI: 10.7270/Q2GT5PGP
Focal adhesion kinase 1
(Homo sapiens (Human))
BDBM50425681
(CHEMBL2315564)
Show SMILES CNC(=O)c1ccccc1Nc1c(cnc2[nH]c(cc12)-c1ccc(F)cc1)C#N
Show InChI InChI=1S/C22H16FN5O/c1-25-22(29)16-4-2-3-5-18(16)27-20-14(11-24)12-26-21-17(20)10-19(28-21)13-6-8-15(23)9-7-13/h2-10,12H,1H3,(H,25,29)(H2,26,27,28)
NCI pathway
Reactome pathway
n/an/a 37n/an/an/an/an/an/a
Merck Serono Research
Curated by ChEMBL
Assay Description
Inhibition of FAK (unknown origin) using biotinylated His-TEV-hsFAK(31-686)(K454R) substrate after 2 hrs by scintillation counting analysis
J Med Chem 56: 1160-70 (2013)
Article DOI: 10.1021/jm3016014
BindingDB Entry DOI: 10.7270/Q2GT5PGP
Focal adhesion kinase 1
(Homo sapiens (Human))
BDBM50425681
(CHEMBL2315564)
Show SMILES CNC(=O)c1ccccc1Nc1c(cnc2[nH]c(cc12)-c1ccc(F)cc1)C#N
Show InChI InChI=1S/C22H16FN5O/c1-25-22(29)16-4-2-3-5-18(16)27-20-14(11-24)12-26-21-17(20)10-19(28-21)13-6-8-15(23)9-7-13/h2-10,12H,1H3,(H,25,29)(H2,26,27,28)
NCI pathway
Reactome pathway
n/an/an/a 40n/an/an/an/an/a
Merck Serono Research
Curated by ChEMBL
Assay Description
Binding affinity to FAK (unknown origin) by surface plasmon resonance analysis
J Med Chem 56: 1160-70 (2013)
Article DOI: 10.1021/jm3016014
BindingDB Entry DOI: 10.7270/Q2GT5PGP