null
SMILES: CC(C)OC(=O)Cn1c(SCCOc2ccc(C)c(C)c2)nc2ccccc12
InChI Key: InChIKey=KJZRAQREJNJTJH-UHFFFAOYSA-N
Activity Spreadsheet -- Enzyme Inhibition Constant Data from BindingDB
Found 1 hit for monomerid = 50425773
Trg + Lig
Ki
nM
ΔG°
kcal/mole
IC50
nM
Kd
nM
EC50/IC50
nM
koff
s-1
kon
M-1s-1
pHTemp
°C
Androgen receptor
(Homo sapiens (Human))
BDBM50425773
(CHEMBL2316565)
Show SMILES CC(C)OC(=O)Cn1c(SCCOc2ccc(C)c(C)c2)nc2ccccc12
Show InChI InChI=1S/C22H26N2O3S/c1-15(2)27-21(25)14-24-20-8-6-5-7-19(20)23-22(24)28-12-11-26-18-10-9-16(3)17(4)13-18/h5-10,13,15H,11-12,14H2,1-4H3
NCI pathway
Reactome pathway
n/an/a 3.06E+4n/an/an/an/an/an/a
University of British Columbia
Curated by ChEMBL
Assay Description
Inhibition of BF3 site of androgen receptor in human LNCAP cells expressing ARR2PB after 3 days by eGFP transcriptional assay
J Med Chem 56: 1136-48 (2013)
Article DOI: 10.1021/jm3015712
BindingDB Entry DOI: 10.7270/Q2ZW1N7N