BDBM50425824 CHEMBL2312289
SMILES: NC(=O)[C@@H]1CCCc2c1[nH]c1ccc(Cl)cc21
InChI Key: InChIKey=FUZYTVDVLBBXDL-SECBINFHSA-N
Data: 1 IC50  1 Kd
Activity Spreadsheet -- Enzyme Inhibition Constant Data from BindingDB
Found 2 hits for monomerid = 50425824
Trg + Lig
Ki
nM
ΔG°
kcal/mole
IC50
nM
Kd
nM
EC50/IC50
nM
koff
s-1
kon
M-1s-1
pHTemp
°C
NAD-Dependent Deacetylase Sirtuin-1
(Homo sapiens (Human))
BDBM50425824
(CHEMBL2312289)
Show SMILES NC(=O)[C@@H]1CCCc2c1[nH]c1ccc(Cl)cc21 |r|
Show InChI InChI=1S/C13H13ClN2O/c14-7-4-5-11-10(6-7)8-2-1-3-9(13(15)17)12(8)16-11/h4-6,9,16H,1-3H2,(H2,15,17)/t9-/m1/s1
NCI pathway
Reactome pathway
n/an/a 98n/an/an/an/an/an/a
Lilly Biotechnology Center San Diego
Curated by ChEMBL
Assay Description
Inhibition of full length SIRT1 (unknown origin) by fluorometric enzyme assay
J Med Chem 56: 963-9 (2013)
Article DOI: 10.1021/jm301431y
BindingDB Entry DOI: 10.7270/Q2B56M22
NAD-Dependent Deacetylase Sirtuin-1
(Homo sapiens (Human))
BDBM50425824
(CHEMBL2312289)
Show SMILES NC(=O)[C@@H]1CCCc2c1[nH]c1ccc(Cl)cc21 |r|
Show InChI InChI=1S/C13H13ClN2O/c14-7-4-5-11-10(6-7)8-2-1-3-9(13(15)17)12(8)16-11/h4-6,9,16H,1-3H2,(H2,15,17)/t9-/m1/s1
NCI pathway
Reactome pathway
n/an/an/a 1.30E+3n/an/an/an/an/a
Lilly Biotechnology Center San Diego
Curated by ChEMBL
Assay Description
Binding affinity to C-terminally His-tagged SIRT1 catalytic domain (241 to 516 amino acid residues plus EGHHHHHH) (unknown origin) expressed in bacul...
J Med Chem 56: 963-9 (2013)
Article DOI: 10.1021/jm301431y
BindingDB Entry DOI: 10.7270/Q2B56M22