BDBM50425835 CHEMBL2312299
SMILES: Cc1cccc(CNc2ncc(C(=O)NCCCN3CCCC3=O)c(NC3CCCC3)n2)c1
InChI Key: InChIKey=WUHHPEQZPAPPGN-UHFFFAOYSA-N
Data: 1 IC50
Activity Spreadsheet -- Enzyme Inhibition Constant Data from BindingDB
Found 1 hit for monomerid = 50425835
Trg + Lig
Ki
nM
ΔG°
kcal/mole
IC50
nM
Kd
nM
EC50/IC50
nM
koff
s-1
kon
M-1s-1
pHTemp
°C
Tyrosine-protein kinase receptor TYRO3
(Homo sapiens (Human))
BDBM50425835
(CHEMBL2312299)
Show SMILES Cc1cccc(CNc2ncc(C(=O)NCCCN3CCCC3=O)c(NC3CCCC3)n2)c1
Show InChI InChI=1S/C25H34N6O2/c1-18-7-4-8-19(15-18)16-27-25-28-17-21(23(30-25)29-20-9-2-3-10-20)24(33)26-12-6-14-31-13-5-11-22(31)32/h4,7-8,15,17,20H,2-3,5-6,9-14,16H2,1H3,(H,26,33)(H2,27,28,29,30)
n/an/a 3.00E+3n/an/an/an/an/an/a
Pfizer Inc.
Curated by ChEMBL
Assay Description
Inhibition of Sky (unknown origin) in presence of 60 uM ATP by ELISA
Bioorg Med Chem Lett 23: 1046-50 (2013)
Article DOI: 10.1016/j.bmcl.2012.12.013
BindingDB Entry DOI: 10.7270/Q26D5V9W