BDBM50425837 CHEMBL2312297
SMILES: Clc1cccc(CNc2ncc(C(=O)NCCCN3CCCC3=O)c(NC3CCCC3)n2)c1
InChI Key: InChIKey=WGZZZCGKYBIFGD-UHFFFAOYSA-N
Data: 1 IC50
Activity Spreadsheet -- Enzyme Inhibition Constant Data from BindingDB
Found 1 hit for monomerid = 50425837
Trg + Lig
Ki
nM
ΔG°
kcal/mole
IC50
nM
Kd
nM
EC50/IC50
nM
koff
s-1
kon
M-1s-1
pHTemp
°C
Tyrosine-protein kinase receptor TYRO3
(Homo sapiens (Human))
BDBM50425837
(CHEMBL2312297)
Show SMILES Clc1cccc(CNc2ncc(C(=O)NCCCN3CCCC3=O)c(NC3CCCC3)n2)c1
Show InChI InChI=1S/C24H31ClN6O2/c25-18-7-3-6-17(14-18)15-27-24-28-16-20(22(30-24)29-19-8-1-2-9-19)23(33)26-11-5-13-31-12-4-10-21(31)32/h3,6-7,14,16,19H,1-2,4-5,8-13,15H2,(H,26,33)(H2,27,28,29,30)
n/an/a 850n/an/an/an/an/an/a
Pfizer Inc.
Curated by ChEMBL
Assay Description
Inhibition of Sky (unknown origin) in presence of 60 uM ATP by ELISA
Bioorg Med Chem Lett 23: 1046-50 (2013)
Article DOI: 10.1016/j.bmcl.2012.12.013
BindingDB Entry DOI: 10.7270/Q26D5V9W