BDBM50425925 CHEMBL2313707
SMILES: COc1cccc(NC(=S)N2CCCC2C(=O)N2CCC(CC2)c2noc3cc(F)ccc23)c1
InChI Key: InChIKey=MQYQEFFJEBOHGM-UHFFFAOYSA-N
Data: 1 IC50
Activity Spreadsheet -- Enzyme Inhibition Constant Data from BindingDB
Found 1 hit for monomerid = 50425925
Trg + Lig
Ki
nM
ΔG°
kcal/mole
IC50
nM
Kd
nM
EC50/IC50
nM
koff
s-1
kon
M-1s-1
pHTemp
°C
Serum albumin
(Bos taurus)
BDBM50425925
(CHEMBL2313707)
Show SMILES COc1cccc(NC(=S)N2CCCC2C(=O)N2CCC(CC2)c2noc3cc(F)ccc23)c1
Show InChI InChI=1S/C25H27FN4O3S/c1-32-19-5-2-4-18(15-19)27-25(34)30-11-3-6-21(30)24(31)29-12-9-16(10-13-29)23-20-8-7-17(26)14-22(20)33-28-23/h2,4-5,7-8,14-16,21H,3,6,9-13H2,1H3,(H,27,34)
Reactome pathway
n/an/a 2.05E+4n/an/an/an/an/an/a
University of Mysore
Curated by ChEMBL
Assay Description
Inhibition of glycation of bovine serum albumin assessed as advanced glycated end product measured after 7 days by spectrofluorimeter in presence of ...
Eur J Med Chem 60: 325-32 (2013)
Article DOI: 10.1016/j.ejmech.2012.12.029
BindingDB Entry DOI: 10.7270/Q2JQ1292