BDBM50425942 CHEMBL2313740
SMILES: COc1ccc(NC(=S)NCC(=O)N2CCC(CC2)c2noc3cc(F)ccc23)cc1
InChI Key: InChIKey=LLRIMTODRAEJAI-UHFFFAOYSA-N
Data: 1 IC50
Activity Spreadsheet -- Enzyme Inhibition Constant Data from BindingDB
Found 1 hit for monomerid = 50425942
Trg + Lig
Ki
nM
ΔG°
kcal/mole
IC50
nM
Kd
nM
EC50/IC50
nM
koff
s-1
kon
M-1s-1
pHTemp
°C
Serum albumin
(Bos taurus)
BDBM50425942
(CHEMBL2313740)
Show SMILES COc1ccc(NC(=S)NCC(=O)N2CCC(CC2)c2noc3cc(F)ccc23)cc1
Show InChI InChI=1S/C22H23FN4O3S/c1-29-17-5-3-16(4-6-17)25-22(31)24-13-20(28)27-10-8-14(9-11-27)21-18-7-2-15(23)12-19(18)30-26-21/h2-7,12,14H,8-11,13H2,1H3,(H2,24,25,31)
Reactome pathway
n/an/a 3.60E+3n/an/an/an/an/an/a
University of Mysore
Curated by ChEMBL
Assay Description
Inhibition of glycation of bovine serum albumin assessed as advanced glycated end product measured after 7 days by spectrofluorimeter in presence of ...
Eur J Med Chem 60: 325-32 (2013)
Article DOI: 10.1016/j.ejmech.2012.12.029
BindingDB Entry DOI: 10.7270/Q2JQ1292