BDBM50425947 CHEMBL2313735
SMILES: COc1ccccc1NC(=O)NCC(=O)N1CCC(CC1)c1noc2cc(F)ccc12
InChI Key: InChIKey=KANBSPGKPKDGHU-UHFFFAOYSA-N
Data: 1 IC50
Activity Spreadsheet -- Enzyme Inhibition Constant Data from BindingDB
Found 1 hit for monomerid = 50425947
Trg + Lig
Ki
nM
ΔG°
kcal/mole
IC50
nM
Kd
nM
EC50/IC50
nM
koff
s-1
kon
M-1s-1
pHTemp
°C
Serum albumin
(Bos taurus)
BDBM50425947
(CHEMBL2313735)
Show SMILES COc1ccccc1NC(=O)NCC(=O)N1CCC(CC1)c1noc2cc(F)ccc12
Show InChI InChI=1S/C22H23FN4O4/c1-30-18-5-3-2-4-17(18)25-22(29)24-13-20(28)27-10-8-14(9-11-27)21-16-7-6-15(23)12-19(16)31-26-21/h2-7,12,14H,8-11,13H2,1H3,(H2,24,25,29)
Reactome pathway
n/an/a 2.02E+4n/an/an/an/an/an/a
University of Mysore
Curated by ChEMBL
Assay Description
Inhibition of glycation of bovine serum albumin assessed as advanced glycated end product measured after 7 days by spectrofluorimeter in presence of ...
Eur J Med Chem 60: 325-32 (2013)
Article DOI: 10.1016/j.ejmech.2012.12.029
BindingDB Entry DOI: 10.7270/Q2JQ1292