BDBM50425955 CHEMBL2314376
SMILES: CC(C)c1ccc(Sc2c[nH]c(=O)c(c2)C#N)cc1
InChI Key: InChIKey=GWTWLBDUTCWFSW-UHFFFAOYSA-N
Data: 1 KI  2 IC50
Activity Spreadsheet -- Enzyme Inhibition Constant Data from BindingDB
Found 3 hits for monomerid = 50425955
Trg + Lig
Ki
nM
ΔG°
kcal/mole
IC50
nM
Kd
nM
EC50/IC50
nM
koff
s-1
kon
M-1s-1
pHTemp
°C
Induced myeloid leukemia cell differentiation protein Mcl-1
(Homo sapiens (Human))
BDBM50425955
(CHEMBL2314376)
Show SMILES CC(C)c1ccc(Sc2c[nH]c(=O)c(c2)C#N)cc1
Show InChI InChI=1S/C15H14N2OS/c1-10(2)11-3-5-13(6-4-11)19-14-7-12(8-16)15(18)17-9-14/h3-7,9-10H,1-2H3,(H,17,18)
NCI pathway
860n/an/an/an/an/an/an/an/a
Dalian University of Technology
Curated by ChEMBL
Assay Description
Inhibition of FAM-Bid peptide binding to Mcl1 (unknown origin) expressed in Escherichia coli BL21 by fluorescence polarization-based binding assay
Eur J Med Chem 60: 410-20 (2013)
Article DOI: 10.1016/j.ejmech.2012.12.016
BindingDB Entry DOI: 10.7270/Q2959JVC
Induced myeloid leukemia cell differentiation protein Mcl-1
(Homo sapiens (Human))
BDBM50425955
(CHEMBL2314376)
Show SMILES CC(C)c1ccc(Sc2c[nH]c(=O)c(c2)C#N)cc1
Show InChI InChI=1S/C15H14N2OS/c1-10(2)11-3-5-13(6-4-11)19-14-7-12(8-16)15(18)17-9-14/h3-7,9-10H,1-2H3,(H,17,18)
NCI pathway
n/an/a 890n/an/an/an/an/an/a
Dalian University of Technology
Curated by ChEMBL
Assay Description
Inhibition of biotin-Bim peptide binding to Mcl1 (unknown origin) expressed in Escherichia coli BL21 by ELISA
Eur J Med Chem 60: 410-20 (2013)
Article DOI: 10.1016/j.ejmech.2012.12.016
BindingDB Entry DOI: 10.7270/Q2959JVC
Induced myeloid leukemia cell differentiation protein Mcl-1
(Homo sapiens (Human))
BDBM50425955
(CHEMBL2314376)
Show SMILES CC(C)c1ccc(Sc2c[nH]c(=O)c(c2)C#N)cc1
Show InChI InChI=1S/C15H14N2OS/c1-10(2)11-3-5-13(6-4-11)19-14-7-12(8-16)15(18)17-9-14/h3-7,9-10H,1-2H3,(H,17,18)
NCI pathway
n/an/a 2.15E+4n/an/an/an/an/an/a
Dalian University of Technology
Curated by ChEMBL
Assay Description
Inhibition of FAM-Bid peptide binding to Mcl1 (unknown origin) expressed in Escherichia coli BL21 by fluorescence polarization-based binding assay
Eur J Med Chem 60: 410-20 (2013)
Article DOI: 10.1016/j.ejmech.2012.12.016
BindingDB Entry DOI: 10.7270/Q2959JVC