BDBM50425960 CHEMBL2314371
SMILES: O=c1[nH]cc(cc1C#N)-c1cccc2ccccc12
InChI Key: InChIKey=KVQJIVIRWAYFCK-UHFFFAOYSA-N
Data: 1 KI  1 IC50
Activity Spreadsheet -- Enzyme Inhibition Constant Data from BindingDB
Found 2 hits for monomerid = 50425960
Trg + Lig
Ki
nM
ΔG°
kcal/mole
IC50
nM
Kd
nM
EC50/IC50
nM
koff
s-1
kon
M-1s-1
pHTemp
°C
Induced myeloid leukemia cell differentiation protein Mcl-1
(Homo sapiens (Human))
BDBM50425960
(CHEMBL2314371)
Show SMILES O=c1[nH]cc(cc1C#N)-c1cccc2ccccc12
Show InChI InChI=1S/C16H10N2O/c17-9-12-8-13(10-18-16(12)19)15-7-3-5-11-4-1-2-6-14(11)15/h1-8,10H,(H,18,19)
NCI pathway
6.32E+3n/an/an/an/an/an/an/an/a
Dalian University of Technology
Curated by ChEMBL
Assay Description
Inhibition of FAM-Bid peptide binding to Mcl1 (unknown origin) expressed in Escherichia coli BL21 by fluorescence polarization-based binding assay
Eur J Med Chem 60: 410-20 (2013)
Article DOI: 10.1016/j.ejmech.2012.12.016
BindingDB Entry DOI: 10.7270/Q2959JVC
Induced myeloid leukemia cell differentiation protein Mcl-1
(Homo sapiens (Human))
BDBM50425960
(CHEMBL2314371)
Show SMILES O=c1[nH]cc(cc1C#N)-c1cccc2ccccc12
Show InChI InChI=1S/C16H10N2O/c17-9-12-8-13(10-18-16(12)19)15-7-3-5-11-4-1-2-6-14(11)15/h1-8,10H,(H,18,19)
NCI pathway
n/an/a 1.59E+5n/an/an/an/an/an/a
Dalian University of Technology
Curated by ChEMBL
Assay Description
Inhibition of FAM-Bid peptide binding to Mcl1 (unknown origin) expressed in Escherichia coli BL21 by fluorescence polarization-based binding assay
Eur J Med Chem 60: 410-20 (2013)
Article DOI: 10.1016/j.ejmech.2012.12.016
BindingDB Entry DOI: 10.7270/Q2959JVC