BDBM50426535 CHEMBL2323945
SMILES: CC(C)Nc1nc2c(C(=O)N(C)C)c(Cl)c(Cl)cc2n1C1CCN(CC1)c1ccc(OC(C)C)cc1
InChI Key: InChIKey=NALJATVDFZCVNT-UHFFFAOYSA-N
Data: 1 IC50
Activity Spreadsheet -- Enzyme Inhibition Constant Data from BindingDB
Found 1 hit for monomerid = 50426535
Trg + Lig
Ki
nM
ΔG°
kcal/mole
IC50
nM
Kd
nM
EC50/IC50
nM
koff
s-1
kon
M-1s-1
pHTemp
°C
Transient receptor potential cation channel subfamily V member 4 (TRPV4)
(Homo sapiens (Human))
BDBM50426535
(CHEMBL2323945)
Show SMILES CC(C)Nc1nc2c(C(=O)N(C)C)c(Cl)c(Cl)cc2n1C1CCN(CC1)c1ccc(OC(C)C)cc1
Show InChI InChI=1S/C27H35Cl2N5O2/c1-16(2)30-27-31-25-22(15-21(28)24(29)23(25)26(35)32(5)6)34(27)19-11-13-33(14-12-19)18-7-9-20(10-8-18)36-17(3)4/h7-10,15-17,19H,11-14H2,1-6H3,(H,30,31)
n/an/a 13n/an/an/an/an/an/a
GlaxoSmithKline
Curated by ChEMBL
Assay Description
Antagonist activity at human recombinant TRPV4 expressed in BacMam virus infected HEK MSRII cells assessed as inhibition of GSK1016790A-induced calci...
ACS Med Chem Lett 4: 293-6 (2013)
Article DOI: 10.1021/ml300449k
BindingDB Entry DOI: 10.7270/Q2VT1TDB