BDBM50426548 CHEMBL2323956
SMILES: C1c2ccccc2-c2n[nH]c(Nc3ccc4OCCOc4c3)c12
InChI Key: InChIKey=CGZKSZVSWAAUHE-UHFFFAOYSA-N
Data: 1 IC50
Activity Spreadsheet -- Enzyme Inhibition Constant Data from BindingDB
Found 1 hit for monomerid = 50426548
Trg + Lig
Ki
nM
ΔG°
kcal/mole
IC50
nM
Kd
nM
EC50/IC50
nM
koff
s-1
kon
M-1s-1
pHTemp
°C
Hypoxia-inducible factor 1-alpha
(Homo sapiens (Human))
BDBM50426548
(CHEMBL2323956)
Show SMILES C1c2ccccc2-c2n[nH]c(Nc3ccc4OCCOc4c3)c12
Show InChI InChI=1S/C18H15N3O2/c1-2-4-13-11(3-1)9-14-17(13)20-21-18(14)19-12-5-6-15-16(10-12)23-8-7-22-15/h1-6,10H,7-9H2,(H2,19,20,21)
Reactome pathway
n/an/a 14n/an/an/an/an/an/a
Gakushuin University
Curated by ChEMBL
Assay Description
Inhibition of hypoxia-induced HIF1alpha transcriptional activity in human HeLa cells expressing HRE-Luc after 12 hrs by luciferase reporter gene assa...
ACS Med Chem Lett 4: 297-301 (2013)
Article DOI: 10.1021/ml3004632
BindingDB Entry DOI: 10.7270/Q2R212P9