BDBM50426579 CHEMBL2324360
SMILES: COc1cccc(c1)N(C)C(=O)c1ccc(s1)-c1cccc(OC)c1F
InChI Key: InChIKey=XXGYSORRVIEKQF-UHFFFAOYSA-N
Data: 3 IC50
Activity Spreadsheet -- Enzyme Inhibition Constant Data from BindingDB
Found 3 hits for monomerid = 50426579
Trg + Lig
Ki
nM
ΔG°
kcal/mole
IC50
nM
Kd
nM
EC50/IC50
nM
koff
s-1
kon
M-1s-1
pHTemp
°C
Estradiol 17-beta-dehydrogenase 2
(Homo sapiens (Human))
BDBM50426579
(CHEMBL2324360)
Show SMILES COc1cccc(c1)N(C)C(=O)c1ccc(s1)-c1cccc(OC)c1F
Show InChI InChI=1S/C20H18FNO3S/c1-22(13-6-4-7-14(12-13)24-2)20(23)18-11-10-17(26-18)15-8-5-9-16(25-3)19(15)21/h4-12H,1-3H3
n/an/a 105n/an/an/an/an/an/a
Saarland University
Curated by ChEMBL
Assay Description
Inhibition of 17beta-HSD2 in human MDA-MB-231 cells using [3H]E2 as substrate after 6 hrs by HPLC analysis
J Med Chem 56: 167-81 (2013)
Article DOI: 10.1021/jm3014053
BindingDB Entry DOI: 10.7270/Q2ZK5J0P
Estradiol 17-beta-dehydrogenase 2
(Homo sapiens (Human))
BDBM50426579
(CHEMBL2324360)
Show SMILES COc1cccc(c1)N(C)C(=O)c1ccc(s1)-c1cccc(OC)c1F
Show InChI InChI=1S/C20H18FNO3S/c1-22(13-6-4-7-14(12-13)24-2)20(23)18-11-10-17(26-18)15-8-5-9-16(25-3)19(15)21/h4-12H,1-3H3
n/an/a 62n/an/an/an/an/an/a
Saarland University
Curated by ChEMBL
Assay Description
Inhibition of 17beta-HSD2 in human placental microsomal fraction using [3H]E2 as substrate assessed as formation of E1 by HPLC analysis
J Med Chem 56: 167-81 (2013)
Article DOI: 10.1021/jm3014053
BindingDB Entry DOI: 10.7270/Q2ZK5J0P
Estradiol 17-beta-dehydrogenase 1 (17beta-HSD1)
(Homo sapiens (Human))
BDBM50426579
(CHEMBL2324360)
Show SMILES COc1cccc(c1)N(C)C(=O)c1ccc(s1)-c1cccc(OC)c1F
Show InChI InChI=1S/C20H18FNO3S/c1-22(13-6-4-7-14(12-13)24-2)20(23)18-11-10-17(26-18)15-8-5-9-16(25-3)19(15)21/h4-12H,1-3H3
Reactome pathway
n/an/a>5.00E+4n/an/an/an/an/an/a
Saarland University
Curated by ChEMBL
Assay Description
Inhibition of 17beta-HSD1 in human placental cytosolic fraction using [3H]E1 as substrate assessed as formation of E2 by HPLC analysis
J Med Chem 56: 167-81 (2013)
Article DOI: 10.1021/jm3014053
BindingDB Entry DOI: 10.7270/Q2ZK5J0P