BDBM50426615 CHEMBL2325900
SMILES: CC(NC(=O)c1c[nH]c2ncc(nc12)C1CC1)C1CC1
InChI Key: InChIKey=MGBQLTSHRNLWDQ-UHFFFAOYSA-N
Data: 3 IC50
Activity Spreadsheet -- Enzyme Inhibition Constant Data from BindingDB
Found 3 hits for monomerid = 50426615
Trg + Lig
Ki
nM
ΔG°
kcal/mole
IC50
nM
Kd
nM
EC50/IC50
nM
koff
s-1
kon
M-1s-1
pHTemp
°C
Tyrosine-protein kinase JAK1
(Homo sapiens (Human))
BDBM50426615
(CHEMBL2325900)
Show SMILES CC(NC(=O)c1c[nH]c2ncc(nc12)C1CC1)C1CC1
Show InChI InChI=1S/C15H18N4O/c1-8(9-2-3-9)18-15(20)11-6-16-14-13(11)19-12(7-17-14)10-4-5-10/h6-10H,2-5H2,1H3,(H,16,17)(H,18,20)
Reactome pathway
n/an/a 24n/an/an/an/an/an/a
Hoffmann-La Roche
Curated by ChEMBL
Assay Description
Inhibition of JAK1 (unknown origin)-mediated phosphorylation of Biotin-KAIETDKEYYTVKD incubated for 10 mins prior to substrate addition measured afte...
J Med Chem 56: 345-56 (2013)
Article DOI: 10.1021/jm301646k
BindingDB Entry DOI: 10.7270/Q2Q241JX
Tyrosine-protein kinase JAK3
(Homo sapiens (Human))
BDBM50426615
(CHEMBL2325900)
Show SMILES CC(NC(=O)c1c[nH]c2ncc(nc12)C1CC1)C1CC1
Show InChI InChI=1S/C15H18N4O/c1-8(9-2-3-9)18-15(20)11-6-16-14-13(11)19-12(7-17-14)10-4-5-10/h6-10H,2-5H2,1H3,(H,16,17)(H,18,20)
Reactome pathway
n/an/a 8.60n/an/an/an/an/an/a
Hoffmann-La Roche
Curated by ChEMBL
Assay Description
Inhibition of JAK3 (unknown origin)-mediated phosphorylation of Biotin-KAIETDKEYYTVKD incubated for 10 mins prior to substrate addition measured afte...
J Med Chem 56: 345-56 (2013)
Article DOI: 10.1021/jm301646k
BindingDB Entry DOI: 10.7270/Q2Q241JX
Tyrosine-protein kinase JAK2
(Homo sapiens (Human))
BDBM50426615
(CHEMBL2325900)
Show SMILES CC(NC(=O)c1c[nH]c2ncc(nc12)C1CC1)C1CC1
Show InChI InChI=1S/C15H18N4O/c1-8(9-2-3-9)18-15(20)11-6-16-14-13(11)19-12(7-17-14)10-4-5-10/h6-10H,2-5H2,1H3,(H,16,17)(H,18,20)
Reactome pathway
n/an/a 22n/an/an/an/an/an/a
Hoffmann-La Roche
Curated by ChEMBL
Assay Description
Inhibition of JAK2 (unknown origin)-mediated phosphorylation of Biotin-KAIETDKEYYTVKD incubated for 10 mins prior to substrate addition measured afte...
J Med Chem 56: 345-56 (2013)
Article DOI: 10.1021/jm301646k
BindingDB Entry DOI: 10.7270/Q2Q241JX