BDBM50426653 CHEMBL2326203
SMILES: CCC(=O)NCCCc1cc(OC)ccc1-c1cccc(OC)c1
InChI Key: InChIKey=ZNOFYIUJRHQQNE-UHFFFAOYSA-N
Data: 2 KI  2 EC50
Activity Spreadsheet -- Enzyme Inhibition Constant Data from BindingDB
Found 4 hits for monomerid = 50426653
Trg + Lig
Ki
nM
ΔG°
kcal/mole
IC50
nM
Kd
nM
EC50/IC50
nM
koff
s-1
kon
M-1s-1
pHTemp
°C
Melatonin receptor
(Homo sapiens (Human))
BDBM50426653
(CHEMBL2326203)
Show SMILES CCC(=O)NCCCc1cc(OC)ccc1-c1cccc(OC)c1
Show InChI InChI=1S/C20H25NO3/c1-4-20(22)21-12-6-8-16-14-18(24-3)10-11-19(16)15-7-5-9-17(13-15)23-2/h5,7,9-11,13-14H,4,6,8,12H2,1-3H3,(H,21,22)
Reactome pathway
0.339n/an/an/an/an/an/an/an/a
Hong Kong University of Science and Technology
Curated by ChEMBL
Assay Description
Displacement of [3H]melatonin from human MT2 receptor expressed in CHO cells after 60 mins by microbeta scintillation method
Bioorg Med Chem 21: 547-52 (2012)
Article DOI: 10.1016/j.bmc.2012.10.060
BindingDB Entry DOI: 10.7270/Q29W0GTX
Melatonin receptor
(Homo sapiens (Human))
BDBM50426653
(CHEMBL2326203)
Show SMILES CCC(=O)NCCCc1cc(OC)ccc1-c1cccc(OC)c1
Show InChI InChI=1S/C20H25NO3/c1-4-20(22)21-12-6-8-16-14-18(24-3)10-11-19(16)15-7-5-9-17(13-15)23-2/h5,7,9-11,13-14H,4,6,8,12H2,1-3H3,(H,21,22)
Reactome pathway
33n/an/an/an/an/an/an/an/a
Hong Kong University of Science and Technology
Curated by ChEMBL
Assay Description
Displacement of [3H]melatonin from human MT1 receptor expressed in CHO cells after 60 mins by microbeta scintillation method
Bioorg Med Chem 21: 547-52 (2012)
Article DOI: 10.1016/j.bmc.2012.10.060
BindingDB Entry DOI: 10.7270/Q29W0GTX
Melatonin receptor
(Homo sapiens (Human))
BDBM50426653
(CHEMBL2326203)
Show SMILES CCC(=O)NCCCc1cc(OC)ccc1-c1cccc(OC)c1
Show InChI InChI=1S/C20H25NO3/c1-4-20(22)21-12-6-8-16-14-18(24-3)10-11-19(16)15-7-5-9-17(13-15)23-2/h5,7,9-11,13-14H,4,6,8,12H2,1-3H3,(H,21,22)
Reactome pathway
n/an/an/an/a 0.200n/an/an/an/a
Hong Kong University of Science and Technology
Curated by ChEMBL
Assay Description
Agonist activity at human MT2 receptor expressed in CHO cells coexpressing Galpha protein 16z25 assessed as increase in calcium mobilization measured...
Bioorg Med Chem 21: 547-52 (2012)
Article DOI: 10.1016/j.bmc.2012.10.060
BindingDB Entry DOI: 10.7270/Q29W0GTX
Melatonin receptor
(Homo sapiens (Human))
BDBM50426653
(CHEMBL2326203)
Show SMILES CCC(=O)NCCCc1cc(OC)ccc1-c1cccc(OC)c1
Show InChI InChI=1S/C20H25NO3/c1-4-20(22)21-12-6-8-16-14-18(24-3)10-11-19(16)15-7-5-9-17(13-15)23-2/h5,7,9-11,13-14H,4,6,8,12H2,1-3H3,(H,21,22)
Reactome pathway
n/an/an/an/a 2.90n/an/an/an/a
Hong Kong University of Science and Technology
Curated by ChEMBL
Assay Description
Agonist activity at human MT1 receptor expressed in CHO cells coexpressing Galpha protein 16z25 assessed as increase in calcium mobilization measured...
Bioorg Med Chem 21: 547-52 (2012)
Article DOI: 10.1016/j.bmc.2012.10.060
BindingDB Entry DOI: 10.7270/Q29W0GTX