BDBM50426684 CHEMBL2326494
SMILES: NC(=O)c1ccn(c1)-c1cccc(c1)N1CCN(CCCCCCc2ccccc2)CC1
InChI Key: InChIKey=FVMSYCQUAMMCEU-UHFFFAOYSA-N
Data: 1 KI  1 IC50
Activity Spreadsheet -- Enzyme Inhibition Constant Data from BindingDB
Found 2 hits for monomerid = 50426684
Trg + Lig
Ki
nM
ΔG°
kcal/mole
IC50
nM
Kd
nM
EC50/IC50
nM
koff
s-1
kon
M-1s-1
pHTemp
°C
Anandamide amidohydrolase
(Mus musculus (mouse))
BDBM50426684
(CHEMBL2326494)
Show SMILES NC(=O)c1ccn(c1)-c1cccc(c1)N1CCN(CCCCCCc2ccccc2)CC1
Show InChI InChI=1S/C27H34N4O/c28-27(32)24-14-16-31(22-24)26-13-8-12-25(21-26)30-19-17-29(18-20-30)15-7-2-1-4-9-23-10-5-3-6-11-23/h3,5-6,8,10-14,16,21-22H,1-2,4,7,9,15,17-20H2,(H2,28,32)
10n/an/an/an/an/an/an/an/a
Universit£ degli Studi di Siena
Curated by ChEMBL
Assay Description
Inhibition of FAAH in mouse brain homogenate using [3Hethanolamine]AEA as substrate incubated for 20 mins prior to substrate addition measured after ...
Bioorg Med Chem Lett 23: 492-5 (2012)
Article DOI: 10.1016/j.bmcl.2012.11.035
BindingDB Entry DOI: 10.7270/Q22B90BK
Fatty-acid amide hydrolase 1
(Homo sapiens (Human))
BDBM50426684
(CHEMBL2326494)
Show SMILES NC(=O)c1ccn(c1)-c1cccc(c1)N1CCN(CCCCCCc2ccccc2)CC1
Show InChI InChI=1S/C27H34N4O/c28-27(32)24-14-16-31(22-24)26-13-8-12-25(21-26)30-19-17-29(18-20-30)15-7-2-1-4-9-23-10-5-3-6-11-23/h3,5-6,8,10-14,16,21-22H,1-2,4,7,9,15,17-20H2,(H2,28,32)
n/an/a>1.00E+3n/an/an/an/an/an/a
Universit£ degli Studi di Siena
Curated by ChEMBL
Assay Description
Inhibition of human FAAH using [3Hethanolamine]AEA as substrate incubated for 20 mins prior to substrate addition measured after 15 mins by beta coun...
Bioorg Med Chem Lett 23: 492-5 (2012)
Article DOI: 10.1016/j.bmcl.2012.11.035
BindingDB Entry DOI: 10.7270/Q22B90BK