BDBM50427034 CHEMBL2322194
SMILES: NS(=O)(=O)OC[C@@H]1C[C@H](C[C@@H]1O)N1CCc2c1ncnc2N[C@H]1CCc2ccccc12
InChI Key: InChIKey=AQGFWBQRVLPCIX-QXGSTGNESA-N
Data: 4 IC50
Activity Spreadsheet -- Enzyme Inhibition Constant Data from BindingDB
Found 4 hits for monomerid = 50427034
Trg + Lig
Ki
nM
ΔG°
kcal/mole
IC50
nM
Kd
nM
EC50/IC50
nM
koff
s-1
kon
M-1s-1
pHTemp
°C
SUMO-activating enzyme subunit 1
(Homo sapiens (Human))
BDBM50427034
(CHEMBL2322194)
Show SMILES NS(=O)(=O)OC[C@@H]1C[C@H](C[C@@H]1O)N1CCc2c1ncnc2N[C@H]1CCc2ccccc12 |r|
Show InChI InChI=1S/C21H27N5O4S/c22-31(28,29)30-11-14-9-15(10-19(14)27)26-8-7-17-20(23-12-24-21(17)26)25-18-6-5-13-3-1-2-4-16(13)18/h1-4,12,14-15,18-19,27H,5-11H2,(H2,22,28,29)(H,23,24,25)/t14-,15+,18-,19-/m0/s1
Reactome pathway
n/an/a 8.20E+3n/an/an/an/an/an/a
University of Toronto Mississauga
Curated by ChEMBL
Assay Description
Inhibition of SAE (unknown origin)
J Med Chem 56: 2165-77 (2013)
Article DOI: 10.1021/jm301420b
BindingDB Entry DOI: 10.7270/Q29P32ZT
NEDD8-activating enzyme E1 regulatory subunit
(Homo sapiens (Human))
BDBM50427034
(CHEMBL2322194)
Show SMILES NS(=O)(=O)OC[C@@H]1C[C@H](C[C@@H]1O)N1CCc2c1ncnc2N[C@H]1CCc2ccccc12 |r|
Show InChI InChI=1S/C21H27N5O4S/c22-31(28,29)30-11-14-9-15(10-19(14)27)26-8-7-17-20(23-12-24-21(17)26)25-18-6-5-13-3-1-2-4-16(13)18/h1-4,12,14-15,18-19,27H,5-11H2,(H2,22,28,29)(H,23,24,25)/t14-,15+,18-,19-/m0/s1
n/an/a 4.70n/an/an/an/an/an/a
University of Toronto Mississauga
Curated by ChEMBL
Assay Description
Inhibition of NAE (unknown origin)
J Med Chem 56: 2165-77 (2013)
Article DOI: 10.1021/jm301420b
BindingDB Entry DOI: 10.7270/Q29P32ZT
Ubiquitin-like modifier-activating enzyme 6
(Homo sapiens (Human))
BDBM50427034
(CHEMBL2322194)
Show SMILES NS(=O)(=O)OC[C@@H]1C[C@H](C[C@@H]1O)N1CCc2c1ncnc2N[C@H]1CCc2ccccc12 |r|
Show InChI InChI=1S/C21H27N5O4S/c22-31(28,29)30-11-14-9-15(10-19(14)27)26-8-7-17-20(23-12-24-21(17)26)25-18-6-5-13-3-1-2-4-16(13)18/h1-4,12,14-15,18-19,27H,5-11H2,(H2,22,28,29)(H,23,24,25)/t14-,15+,18-,19-/m0/s1
Reactome pathway
n/an/a 1.80E+3n/an/an/an/an/an/a
University of Toronto Mississauga
Curated by ChEMBL
Assay Description
Inhibition of UBA6 (unknown origin)
J Med Chem 56: 2165-77 (2013)
Article DOI: 10.1021/jm301420b
BindingDB Entry DOI: 10.7270/Q29P32ZT
Ubiquitin-like modifier-activating enzyme ATG7
(Homo sapiens (Human))
BDBM50427034
(CHEMBL2322194)
Show SMILES NS(=O)(=O)OC[C@@H]1C[C@H](C[C@@H]1O)N1CCc2c1ncnc2N[C@H]1CCc2ccccc12 |r|
Show InChI InChI=1S/C21H27N5O4S/c22-31(28,29)30-11-14-9-15(10-19(14)27)26-8-7-17-20(23-12-24-21(17)26)25-18-6-5-13-3-1-2-4-16(13)18/h1-4,12,14-15,18-19,27H,5-11H2,(H2,22,28,29)(H,23,24,25)/t14-,15+,18-,19-/m0/s1
Reactome pathway
n/an/a>1.00E+4n/an/an/an/an/an/a
University of Toronto Mississauga
Curated by ChEMBL
Assay Description
Inhibition of ATG7 (unknown origin)
J Med Chem 56: 2165-77 (2013)
Article DOI: 10.1021/jm301420b
BindingDB Entry DOI: 10.7270/Q29P32ZT