BDBM50427090 CHEMBL2322863
SMILES: COc1cc(ccc1Cl)N1CCN(CC1)C(=O)Cn1cc(Cl)c(n1)C(F)(F)F
InChI Key: InChIKey=LBXBGARDGWQLIY-UHFFFAOYSA-N
Data: 1 IC50
Activity Spreadsheet -- Enzyme Inhibition Constant Data from BindingDB
Found 1 hit for monomerid = 50427090
Trg + Lig
Ki
nM
ΔG°
kcal/mole
IC50
nM
Kd
nM
EC50/IC50
nM
koff
s-1
kon
M-1s-1
pHTemp
°C
C-C chemokine receptor type 1
(Homo sapiens (Human))
BDBM50427090
(CHEMBL2322863)
Show SMILES COc1cc(ccc1Cl)N1CCN(CC1)C(=O)Cn1cc(Cl)c(n1)C(F)(F)F
Show InChI InChI=1S/C17H17Cl2F3N4O2/c1-28-14-8-11(2-3-12(14)18)24-4-6-25(7-5-24)15(27)10-26-9-13(19)16(23-26)17(20,21)22/h2-3,8-9H,4-7,10H2,1H3
Reactome pathway
n/an/a 18n/an/an/an/an/an/a
ChemoCentryx, Inc.
Curated by ChEMBL
Assay Description
Displacement of [125I]-CCL3/MIP-1alpha from CCR1 in human THP1 cells
Bioorg Med Chem Lett 23: 1228-31 (2013)
Article DOI: 10.1016/j.bmcl.2013.01.005
BindingDB Entry DOI: 10.7270/Q2NZ88Z2